{"text_format":"1","workbook":"xlsx","n_sheets":21,"sheets":["Instructions","Menu Item Change Log","Cat 1 Setup (example to overide","Cat 1 CM$","Cat 1 CM$ Chart","Cat 1 CM%","Cat 1 CM% Chart","Cat 2 Setup","Cat 2 CM$","Cat 2 CM$ Chart","Cat 2 CM%","Cat 2 CM% Chart","Cat 3 Setup","Cat 3 CM$","Cat 3 CM$ Chart","Cat 3 CM%","Cat 3 CM% Chart","Costing-BP","Costing-Cafe","Insights_Actions","Sheet5"],"not_rendered":{"charts":6,"images":3,"macros":1,"external_links":0,"defined_names":6,"comments":0,"pivot_tables":0},"unopened":[],"bounds":{"document_bytes":16777216,"sheet_cells":100000,"rows_first":2000,"rows_last":500,"rows_between":2000,"halvings":0,"cell_chars":16384,"cell_head_chars":4096},"cells_cut":0,"cells_raw":0,"read":"whole","date_system":"1900"}

{"sheet":"Instructions","index":0,"n_rows":0,"n_cols":0,"rows_kept":0,"cut":false,"hidden":false,"merged":[[1,4,1,10]]}

{"sheet":"Menu Item Change Log","index":1,"n_rows":38,"n_cols":14,"rows_kept":38,"cut":false,"hidden":false,"merged":[[36,11,36,13],[37,11,37,13],[36,6,36,8],[37,6,37,8],[26,10,26,13],[30,11,30,13],[31,11,31,13],[32,11,32,13],[33,11,33,13],[34,11,34,13],[35,11,35,13],[37,1,37,3],[26,5,26,8],[30,6,30,8],[31,6,31,8],[32,6,32,8],[33,6,33,8],[34,6,34,8],[35,6,35,8],[26,0,26,3],[30,1,30,3],[36,1,36,3],[35,1,35,3],[31,1,31,3],[32,1,32,3],[33,1,33,3],[34,1,34,3],[24,11,24,13],[9,11,9,13],[10,11,10,13],[11,11,11,13],[13,10,13,13],[17,11,17,13],[18,11,18,13],[19,11,19,13],[20,11,20,13],[21,11,21,13],[22,11,22,13],[23,11,23,13],[0,10,0,13],[4,11,4,13],[5,11,5,13],[6,11,6,13],[7,11,7,13],[8,11,8,13],[21,1,21,3],[22,1,22,3],[23,1,23,3],[24,1,24,3],[21,6,21,8],[22,6,22,8],[23,6,23,8],[24,6,24,8],[20,1,20,3],[13,5,13,8],[9,1,9,3],[10,1,10,3],[11,1,11,3],[11,6,11,8],[13,0,13,3],[19,1,19,3],[20,6,20,8],[7,6,7,8],[8,6,8,8],[9,6,9,8],[10,6,10,8],[17,6,17,8],[18,6,18,8],[19,6,19,8],[7,1,7,3],[8,1,8,3],[5,1,5,3],[17,1,17,3],[18,1,18,3],[0,5,0,8],[4,6,4,8],[5,6,5,8],[6,6,6,8],[0,0,0,3],[4,1,4,3],[6,1,6,3]]}
["Menu Item Change Log -Example",null,null,null,null,"Menu Item Change Log ",null,null,null,null,"Menu Item Change Log "]
["Outlet ","Revenue Center ","Meal Period ","Date of change ",null,"Outlet ","Revenue Center ","Meal Period ","Date of change ",null,"Outlet ","Revenue Center ","Meal Period ","Date of change "]
["PB&G","PB&G","All-Day","2023-03-26"]
[]
["Item Name: ","TUNA POKE",null,null,null,"Item Name: ",null,null,null,null,"Item Name: "]
["Current Quadarant: ","Star",null,null,null,"Current Quadarant:",null,null,null,null,"Current Quadarant:"]
["Description of change:","Change marination and accoutrement, change tuna spec for larger Saku loin",null,null,null,"Description of change: ",null,null,null,null,"Description of change: "]
["Reason for change: ","Move to a lighter soy & sesame flavor, Tuna spec change drops cost",null,null,null,"Reason for change:",null,null,null,null,"Reason for change:"]
["Impact on food cost:","cost dropped to 3.76/16.35%",null,null,null,"Impact on food cost:",null,null,null,null,"Impact on food cost:"]
["Impact on menu price: ","None",null,null,null,"Impact on menu price: ",null,null,null,null,"Impact on menu price: "]
["Date of next review:","2023-06-01",null,null,null,"Date of next review: ",null,null,null,null,"Date of next review: "]
["Notes:",null,null,null,null,"Notes: ",null,null,null,null,"Notes: "]
[]
["Menu Item Change Log ",null,null,null,null,"Menu Item Change Log ",null,null,null,null,"Menu Item Change Log "]
["Outlet ","Revenue Center ","Meal Period ","Date of change ",null,"Outlet ","Revenue Center ","Meal Period ","Date of change ",null,"Outlet ","Revenue Center ","Meal Period ","Date of change "]
[]
[]
["Item Name: ",null,null,null,null,"Item Name: ",null,null,null,null,"Item Name: "]
["Current Quadarant:",null,null,null,null,"Current Quadarant:",null,null,null,null,"Current Quadarant:"]
["Description of change: ",null,null,null,null,"Description of change: ",null,null,null,null,"Description of change: "]
["Reason for change:",null,null,null,null,"Reason for change:",null,null,null,null,"Reason for change:"]
["Impact on food cost:",null,null,null,null,"Impact on food cost:",null,null,null,null,"Impact on food cost:"]
["Impact on menu price: ",null,null,null,null,"Impact on menu price: ",null,null,null,null,"Impact on menu price: "]
["Date of next review: ",null,null,null,null,"Date of next review: ",null,null,null,null,"Date of next review: "]
["Notes: ",null,null,null,null,"Notes: ",null,null,null,null,"Notes: "]
[]
["Menu Item Change Log ",null,null,null,null,"Menu Item Change Log ",null,null,null,null,"Menu Item Change Log "]
["Outlet ","Revenue Center ","Meal Period ","Date of change ",null,"Outlet ","Revenue Center ","Meal Period ","Date of change ",null,"Outlet ","Revenue Center ","Meal Period ","Date of change "]
[]
[]
["Item Name: ",null,null,null,null,"Item Name: ",null,null,null,null,"Item Name: "]
["Current Quadarant:",null,null,null,null,"Current Quadarant:",null,null,null,null,"Current Quadarant:"]
["Description of change: ",null,null,null,null,"Description of change: ",null,null,null,null,"Description of change: "]
["Reason for change:",null,null,null,null,"Reason for change:",null,null,null,null,"Reason for change:"]
["Impact on food cost:",null,null,null,null,"Impact on food cost:",null,null,null,null,"Impact on food cost:"]
["Impact on menu price: ",null,null,null,null,"Impact on menu price: ",null,null,null,null,"Impact on menu price: "]
["Date of next review: ",null,null,null,null,"Date of next review: ",null,null,null,null,"Date of next review: "]
["Notes: ",null,null,null,null,"Notes: ",null,null,null,null,"Notes: "]

{"sheet":"Cat 1 Setup (example to overide","index":2,"n_rows":59,"n_cols":16,"rows_kept":59,"cut":false,"hidden":false,"merged":[[5,0,6,5],[3,14,4,15]]}
[null,null,null,null,null,null,null,null,null,null,"Restaurant Outlet Name","Blue Café","Check Count",600]
[null,null,null,null,null,null,null,null,null,null,"Meal Period","Dinner","Cover Count",1688]
[null,null,null,null,null,null,null,null,null,null,"Revenue Center","Dining Room","Average Check",48.09]
[null,null,null,null,null,null,null,null,null,null,"Menu Category","Entrée","Currency",{"$f":"IFERROR(IF(LEFT(N9,(FIND(MID(N9,MIN(IF(ISNUMBER(1*MID(N9,ROW($1:$254),1)),ROW($1:$254))),1),N9)-1))=\"\",\"$\",LEFT(N9,(FIND(MID(N9,MIN(IF(ISNUMBER(1*MID(N9,ROW($1:$254),1)),ROW($1:$254))),1),N9)-1))),\"\")","v":"$"}]
[null,null,null,null,null,null,null,null,null,null,"Start Date","2023-11-01","End Date","2023-01-31"]
[]
[]
["Item Name","Item Number","Qty Sold","Gross Sales","Avg. Item Cost","COGS $",null,null,null,null,"Item Name","Item Number","Qty Sold","Gross Sales","Avg. Item Cost","COGS $"]
[{"$f":"K9","v":"SALMON"},10341,{"$f":"VALUE(M9)","v":998},{"$f":"IF($N$4=\"$\",N9,(VALUE(MID(N9,FIND($N$4,N9)+LEN($N$4),LEN(N9)))))","v":25948},{"$f":"IF($N$4=\"$\",O9,(VALUE(MID(O9,FIND($N$4,O9)+LEN($N$4),LEN(O9)))))","v":5.36},{"$f":"IF($N$4=\"$\",P9,(VALUE(MID(P9,FIND($N$4,P9)+LEN($N$4),LEN(P9)))))","v":5349.28},null,null,null,1,"SALMON",10341,998,25948,5.36,5349.28]
["TROUT AMADINE",10302,{"$f":"VALUE(M10)","v":953},22872,7.55,7195.15,null,null,null,2,"TROUT AMADINE",10302,953,22872,7.55,7195.15]
["MOULES FRITES",10303,927,16222.5,5.46,5061.42,null,null,null,3,"MOULES FRITES",10303,927,16222.5,5.46,5061.42]
["WILD HALIBUT",10332,919,26651,18.97,17433.43,null,null,null,4,"WILD HALIBUT",10332,919,26651,18.97,17433.43]
["BRAISED SHORT RIB",10314,871,22646,11.46,9981.66,null,null,null,5,"BRAISED SHORT RIB",10314,871,22646,11.46,9981.66]
["LAMB SHANK",10394,833,23324,10.48,8729.84,null,null,null,6,"LAMB SHANK",10394,833,23324,10.48,8729.84]
["ROTISSERIE DUCK",10316,827,23983,10.61,8774.4699999999993,null,null,null,7,"ROTISSERIE DUCK",10316,827,23983,10.61,8774.4699999999993]
["NEW YORK STRIP",10329,818,26176,12.54,10259.9,null,null,null,8,"NEW YORK STRIP",10329,818,26176,12.54,10259.9]
["SPAGHETTI BOLOGNESE",10304,612,9792,3.16,1933.92,null,null,null,9,"SPAGHETTI BOLOGNESE",10304,612,9792,3.16,1933.92]
["SEARED SEA SCALLOPS",10343,564,15792,9.41,5306.26,null,null,null,10,"SEARED SEA SCALLOPS",10343,564,15792,9.41,5306.26]
["OMELET",10308,428,5564,3.34,1429.52,null,null,null,11,"OMELET",10308,428,5564,3.34,1429.52]
["ENTREE OF RAVIOLI",10310,354,7080,2.64,934.56,null,null,null,12,"ENTREE OF RAVIOLI",10310,354,7080,2.64,934.56]
["DOVER SOLE",10348,250,7750,20.170000000000002,5042.5,null,null,null,13,"DOVER SOLE",10348,250,7750,20.170000000000002,5042.5]
["LOUP DE MER",10380,214,5564,10.91,2334.7399999999998,null,null,null,14,"LOUP DE MER",10380,214,5564,10.91,2334.7399999999998]
["BOUILLABAISSE",10325,198,5544,10.82,2142.36,null,null,null,15,"BOUILLABAISSE",10325,198,5544,10.82,2142.36]
["DUNGENESS CRAB SPAGHETTI",10398,191,6112,11.39,2175.4899999999998,null,null,null,16,"DUNGENESS CRAB SPAGHETTI",10398,191,6112,11.39,2175.4899999999998]
[{"$f":"K25","v":"FARFALLE"},10023,185,2960,3.22,595.70000000000005,null,null,null,17,"FARFALLE",10023,185,2960,3.22,595.70000000000005]
["VEAL MEDALLIONS",10372,182,6188,12.67,2305.94,null,null,null,18,"VEAL MEDALLIONS",10372,182,6188,12.67,2305.94]
["LOBSTER AMERICAINE",10340,166,5478,13.16,2184.56,null,null,null,19,"LOBSTER AMERICAINE",10340,166,5478,13.16,2184.56]
["PORK MILANESE",10356,163,4238,7.48,1219.24,null,null,null,20,"PORK MILANESE",10356,163,4238,7.48,1219.24]
[{"$f":"K29","v":0},0,0,0,0,0,null,null,null,21]
[0,0,0,0,0,0,null,null,null,22]
[0,0,0,0,0,0,null,null,null,23]
[0,0,0,0,0,0,null,null,null,24]
[0,0,0,0,0,0,null,null,null,25]
[0,0,0,0,0,0,null,null,null,26]
[{"$f":"K35","v":0},{"$f":"L35","v":0},0,0,0,0,null,null,null,27]
[0,0,0,0,0,0,null,null,null,28]
[0,0,0,0,0,0,null,null,null,29]
[0,0,0,0,0,0,null,null,null,30]
[0,0,0,0,0,0,null,null,null,31]
[0,0,0,0,0,0,null,null,null,32]
[0,0,0,{"$f":"IF($N$4=\"$\",N41,(VALUE(MID(N41,FIND($N$4,N41)+LEN($N$4),LEN(N41)))))","v":0},{"$f":"IF($N$4=\"$\",O41,(VALUE(MID(O41,FIND($N$4,O41)+LEN($N$4),LEN(O41)))))","v":0},{"$f":"IF($N$4=\"$\",P41,(VALUE(MID(P41,FIND($N$4,P41)+LEN($N$4),LEN(P41)))))","v":0},null,null,null,33]
[0,0,0,0,0,0,null,null,null,34]
[0,0,0,0,0,0,null,null,null,35]
[0,0,0,0,0,0,null,null,null,36]
[0,0,0,0,0,0,null,null,null,37]
[0,0,0,0,0,0,null,null,null,38]
[0,0,0,0,0,0,null,null,null,39]
[0,0,0,0,0,0,null,null,null,40]
[0,0,0,0,0,0,null,null,null,41]
[0,0,0,0,0,0,null,null,null,42]
[0,0,0,0,0,0,null,null,null,43]
[0,0,0,0,0,0,null,null,null,44]
[0,0,0,0,0,0,null,null,null,45]
[0,0,0,0,0,0,null,null,null,46]
[0,{"$f":"L55","v":0},0,0,0,0,null,null,null,47]
[0,0,0,0,0,0,null,null,null,48]
[0,0,0,0,0,0,null,null,null,49]
[0,0,0,0,0,0,null,null,null,50]
[null,null,{"$f":"SUM(C9:C58)","v":10653},{"$f":"SUM(D9:D58)","v":269884.5},null,{"$f":"SUM(F9:F58)","v":100389.94}]

{"sheet":"Cat 1 CM$","index":3,"n_rows":173,"n_cols":12,"rows_kept":173,"cut":false,"hidden":false,"merged":[[34,1,35,1],[37,1,38,1],[40,1,41,1],[171,3,171,4],[172,3,172,4],[67,1,68,1],[49,1,50,1],[52,1,53,1],[55,1,56,1],[58,1,59,1],[61,1,62,1],[148,1,149,1],[151,1,152,1],[91,1,92,1],[94,1,95,1],[158,1,159,2],[160,1,160,2],[118,1,119,1],[115,1,116,1],[112,1,113,1],[121,1,122,1],[124,1,125,1],[127,1,128,1],[130,1,131,1],[133,1,134,1],[136,1,137,1],[139,1,140,1],[142,1,143,1],[145,1,146,1],[106,1,107,1],[109,1,110,1],[154,1,155,1],[82,1,83,1],[85,1,86,1],[88,1,89,1],[97,1,98,1],[100,1,101,1],[103,1,104,1],[79,1,80,1],[7,1,8,1],[10,1,11,1],[70,1,71,1],[73,1,74,1],[76,1,77,1],[13,1,14,1],[16,1,17,1],[19,1,20,1],[22,1,23,1],[25,1,26,1],[43,1,44,1],[46,1,47,1],[64,1,65,1],[28,1,29,1],[31,1,32,1]]}
[null,"Restaurant Name",{"$f":"'Cat 1 Setup (example to overide'!L1","v":"Blue Café"}]
[null,"Start Date:",{"$f":"'Cat 1 Setup (example to overide'!L5","v":"2023-11-01"},null,"Check Count:",{"$f":"'Cat 1 Setup (example to overide'!N1","v":600}]
[null,"End Date",{"$f":"'Cat 1 Setup (example to overide'!N5","v":"2023-01-31"},null,"Cover Count:",{"$f":"'Cat 1 Setup (example to overide'!N2","v":1688}]
[null,"Meal Period:",{"$f":"'Cat 1 Setup (example to overide'!L2","v":"Dinner"},null,"Average Check:",{"$f":"'Cat 1 Setup (example to overide'!N3","v":48.09}]
[null,"Revenue Center:",{"$f":"'Cat 1 Setup (example to overide'!L3","v":"Dining Room"},null,"Menu Category",{"$f":"'Cat 1 Setup (example to overide'!L4","v":"Entrée"}]
[]
[null,"Item Name","Quadrant","Item Sales","Qty Sold","Food Cost","Menu Mix %","Item Cost %","Contribution Margin $","Item Price","Item/Cover%","Item Cost"]
["Baseline",{"$f":"'Cat 1 Setup (example to overide'!A9","v":"SALMON"},{"$f":"IFERROR(IF(AND(I8>$I$159,G8>$G$159),\"Star\",IF(AND(I8>$I$159,G8<$G$159),\"Puzzle\",IF(AND(I8<$I$159,G8>$G$159),\"Plow Horse\",\"Dog\"))),\"\")","v":"Star"},{"$f":"IFERROR(VLOOKUP(B8,'Cat 1 Setup (example to overide'!$A:$F,4,FALSE),\"\")","v":25948},{"$f":"IFERROR(VLOOKUP(B8,'Cat 1 Setup (example to overide'!$A:$F,3,FALSE),\"\")","v":998},{"$f":"IFERROR(VLOOKUP(B8,'Cat 1 Setup (example to overide'!$A:$F,6,FALSE),\"\")","v":5349.28},{"$f":"IFERROR(E8/$E$159,\"\")","v":9.3682530742513842E-2},{"$f":"IFERROR(F8/D8,\"\")","v":0.20615384615384613},{"$f":"IFERROR(J8-L8,\"\")","v":20.64},{"$f":"IFERROR(D8/E8,\"\")","v":26},{"$f":"IFERROR(E8/$F$3,\"\")","v":0.59123222748815163},{"$f":"IFERROR(J8*H8,\"\")","v":5.3599999999999994}]
["Proposed",null,{"$f":"IFERROR(IF(AND(I9>$I$160,G9>$G$160),\"Star\",IF(AND(I9>$I$160,G9<$G$160),\"Puzzle\",IF(AND(I9<$I$160,G9>$G$160),\"Plow Horse\",\"Dog\"))),\"\")","v":"Star"},{"$f":"IFERROR(IF(J9=\"\",D8,E9*J9),D8)","v":25948},{"$f":"IFERROR(IF(K9=\"\",E8,K9*$F$3),E8)","v":998},{"$f":"IFERROR(D9*H9,F8)","v":5349.28},{"$f":"IFERROR(IF(E9=\"\",G8,E9/$E$160),G8)","v":9.3682530742513842E-2},{"$f":"IFERROR(IF(L9=\"\",H8,L9/J9),H8)","v":0.20615384615384613},{"$f":"IFERROR(J9-L9,\"\")","v":20.64},{"$f":"J8","v":26},{"$f":"K8","v":0.59123222748815163},{"$f":"L8","v":5.3599999999999994}]
[]
["Baseline",{"$f":"'Cat 1 Setup (example to overide'!A10","v":"TROUT AMADINE"},{"$f":"IFERROR(IF(AND(I11>$I$159,G11>$G$159),\"Star\",IF(AND(I11>$I$159,G11<$G$159),\"Puzzle\",IF(AND(I11<$I$159,G11>$G$159),\"Plow Horse\",\"Dog\"))),\"\")","v":"Star"},{"$f":"IFERROR(VLOOKUP(B11,'Cat 1 Setup (example to overide'!$A:$F,4,FALSE),\"\")","v":22872},{"$f":"IFERROR(VLOOKUP(B11,'Cat 1 Setup (example to overide'!$A:$F,3,FALSE),\"\")","v":953},{"$f":"IFERROR(VLOOKUP(B11,'Cat 1 Setup (example to overide'!$A:$F,6,FALSE),\"\")","v":7195.15},{"$f":"IFERROR(E11/$E$159,\"\")","v":8.945836853468507E-2},{"$f":"IFERROR(F11/D11,\"\")","v":0.31458333333333333},{"$f":"IFERROR(J11-L11,\"\")","v":16.45},{"$f":"IFERROR(D11/E11,\"\")","v":24},{"$f":"IFERROR(E11/$F$3,\"\")","v":0.56457345971563977},{"$f":"IFERROR(J11*H11,\"\")","v":7.55}]
["Proposed",null,{"$f":"IFERROR(IF(AND(I12>$I$160,G12>$G$160),\"Star\",IF(AND(I12>$I$160,G12<$G$160),\"Puzzle\",IF(AND(I12<$I$160,G12>$G$160),\"Plow Horse\",\"Dog\"))),\"\")","v":"Star"},{"$f":"IFERROR(IF(J12=\"\",D11,E12*J12),D11)","v":22871.999999999996},{"$f":"IFERROR(IF(K12=\"\",E11,K12*$F$3),E11)","v":952.99999999999989},{"$f":"IFERROR(D12*H12,F11)","v":7195.1499999999987},{"$f":"IFERROR(IF(E12=\"\",G11,E12/$E$160),G11)","v":8.9458368534685057E-2},{"$f":"IFERROR(IF(L12=\"\",H11,L12/J12),H11)","v":0.31458333333333333},{"$f":"IFERROR(J12-L12,\"\")","v":16.45},{"$f":"J11","v":24},{"$f":"K11","v":0.56457345971563977},{"$f":"L11","v":7.55}]
[]
["Baseline",{"$f":"'Cat 1 Setup (example to overide'!A11","v":"MOULES FRITES"},{"$f":"IFERROR(IF(AND(I14>$I$159,G14>$G$159),\"Star\",IF(AND(I14>$I$159,G14<$G$159),\"Puzzle\",IF(AND(I14<$I$159,G14>$G$159),\"Plow Horse\",\"Dog\"))),\"\")","v":"Plow Horse"},{"$f":"IFERROR(VLOOKUP(B14,'Cat 1 Setup (example to overide'!$A:$F,4,FALSE),\"\")","v":16222.5},{"$f":"IFERROR(VLOOKUP(B14,'Cat 1 Setup (example to overide'!$A:$F,3,FALSE),\"\")","v":927},{"$f":"IFERROR(VLOOKUP(B14,'Cat 1 Setup (example to overide'!$A:$F,6,FALSE),\"\")","v":5061.42},{"$f":"IFERROR(E14/$E$159,\"\")","v":8.7017741481272878E-2},{"$f":"IFERROR(F14/D14,\"\")","v":0.312},{"$f":"IFERROR(J14-L14,\"\")","v":12.04},{"$f":"IFERROR(D14/E14,\"\")","v":17.5},{"$f":"IFERROR(E14/$F$3,\"\")","v":0.54917061611374407},{"$f":"IFERROR(J14*H14,\"\")","v":5.46}]
["Proposed",null,{"$f":"IFERROR(IF(AND(I15>$I$160,G15>$G$160),\"Star\",IF(AND(I15>$I$160,G15<$G$160),\"Puzzle\",IF(AND(I15<$I$160,G15>$G$160),\"Plow Horse\",\"Dog\"))),\"\")","v":"Plow Horse"},{"$f":"IFERROR(IF(J15=\"\",D14,E15*J15),D14)","v":16222.5},{"$f":"IFERROR(IF(K15=\"\",E14,K15*$F$3),E14)","v":927},{"$f":"IFERROR(D15*H15,F14)","v":5061.42},{"$f":"IFERROR(IF(E15=\"\",G14,E15/$E$160),G14)","v":8.7017741481272878E-2},{"$f":"IFERROR(IF(L15=\"\",H14,L15/J15),H14)","v":0.312},{"$f":"IFERROR(J15-L15,\"\")","v":12.04},{"$f":"J14","v":17.5},{"$f":"K14","v":0.54917061611374407},{"$f":"L14","v":5.46}]
[]
["Baseline",{"$f":"'Cat 1 Setup (example to overide'!A12","v":"WILD HALIBUT"},{"$f":"IFERROR(IF(AND(I17>$I$159,G17>$G$159),\"Star\",IF(AND(I17>$I$159,G17<$G$159),\"Puzzle\",IF(AND(I17<$I$159,G17>$G$159),\"Plow Horse\",\"Dog\"))),\"\")","v":"Plow Horse"},{"$f":"IFERROR(VLOOKUP(B17,'Cat 1 Setup (example to overide'!$A:$F,4,FALSE),\"\")","v":26651},{"$f":"IFERROR(VLOOKUP(B17,'Cat 1 Setup (example to overide'!$A:$F,3,FALSE),\"\")","v":919},{"$f":"IFERROR(VLOOKUP(B17,'Cat 1 Setup (example to overide'!$A:$F,6,FALSE),\"\")","v":17433.43},{"$f":"IFERROR(E17/$E$159,\"\")","v":8.6266779310992206E-2},{"$f":"IFERROR(F17/D17,\"\")","v":0.65413793103448281},{"$f":"IFERROR(J17-L17,\"\")","v":10.029999999999998},{"$f":"IFERROR(D17/E17,\"\")","v":29},{"$f":"IFERROR(E17/$F$3,\"\")","v":0.54443127962085303},{"$f":"IFERROR(J17*H17,\"\")","v":18.970000000000002}]
["Proposed",null,{"$f":"IFERROR(IF(AND(I18>$I$160,G18>$G$160),\"Star\",IF(AND(I18>$I$160,G18<$G$160),\"Puzzle\",IF(AND(I18<$I$160,G18>$G$160),\"Plow Horse\",\"Dog\"))),\"\")","v":"Plow Horse"},{"$f":"IFERROR(IF(J18=\"\",D17,E18*J18),D17)","v":26650.999999999996},{"$f":"IFERROR(IF(K18=\"\",E17,K18*$F$3),E17)","v":918.99999999999989},{"$f":"IFERROR(D18*H18,F17)","v":17433.43},{"$f":"IFERROR(IF(E18=\"\",G17,E18/$E$160),G17)","v":8.6266779310992192E-2},{"$f":"IFERROR(IF(L18=\"\",H17,L18/J18),H17)","v":0.65413793103448281},{"$f":"IFERROR(J18-L18,\"\")","v":10.029999999999998},{"$f":"J17","v":29},{"$f":"K17","v":0.54443127962085303},{"$f":"L17","v":18.970000000000002}]
[]
["Baseline",{"$f":"'Cat 1 Setup (example to overide'!A13","v":"BRAISED SHORT RIB"},{"$f":"IFERROR(IF(AND(I20>$I$159,G20>$G$159),\"Star\",IF(AND(I20>$I$159,G20<$G$159),\"Puzzle\",IF(AND(I20<$I$159,G20>$G$159),\"Plow Horse\",\"Dog\"))),\"\")","v":"Plow Horse"},{"$f":"IFERROR(VLOOKUP(B20,'Cat 1 Setup (example to overide'!$A:$F,4,FALSE),\"\")","v":22646},{"$f":"IFERROR(VLOOKUP(B20,'Cat 1 Setup (example to overide'!$A:$F,3,FALSE),\"\")","v":871},{"$f":"IFERROR(VLOOKUP(B20,'Cat 1 Setup (example to overide'!$A:$F,6,FALSE),\"\")","v":9981.66},{"$f":"IFERROR(E20/$E$159,\"\")","v":8.1761006289308172E-2},{"$f":"IFERROR(F20/D20,\"\")","v":0.44076923076923075},{"$f":"IFERROR(J20-L20,\"\")","v":14.540000000000001},{"$f":"IFERROR(D20/E20,\"\")","v":26},{"$f":"IFERROR(E20/$F$3,\"\")","v":0.51599526066350709},{"$f":"IFERROR(J20*H20,\"\")","v":11.459999999999999}]
["Proposed",null,{"$f":"IFERROR(IF(AND(I21>$I$160,G21>$G$160),\"Star\",IF(AND(I21>$I$160,G21<$G$160),\"Puzzle\",IF(AND(I21<$I$160,G21>$G$160),\"Plow Horse\",\"Dog\"))),\"\")","v":"Plow Horse"},{"$f":"IFERROR(IF(J21=\"\",D20,E21*J21),D20)","v":22646},{"$f":"IFERROR(IF(K21=\"\",E20,K21*$F$3),E20)","v":871},{"$f":"IFERROR(D21*H21,F20)","v":9981.66},{"$f":"IFERROR(IF(E21=\"\",G20,E21/$E$160),G20)","v":8.1761006289308172E-2},{"$f":"IFERROR(IF(L21=\"\",H20,L21/J21),H20)","v":0.44076923076923075},{"$f":"IFERROR(J21-L21,\"\")","v":14.540000000000001},{"$f":"J20","v":26},{"$f":"K20","v":0.51599526066350709},{"$f":"L20","v":11.459999999999999}]
[]
["Baseline",{"$f":"'Cat 1 Setup (example to overide'!A14","v":"LAMB SHANK"},{"$f":"IFERROR(IF(AND(I23>$I$159,G23>$G$159),\"Star\",IF(AND(I23>$I$159,G23<$G$159),\"Puzzle\",IF(AND(I23<$I$159,G23>$G$159),\"Plow Horse\",\"Dog\"))),\"\")","v":"Star"},{"$f":"IFERROR(VLOOKUP(B23,'Cat 1 Setup (example to overide'!$A:$F,4,FALSE),\"\")","v":23324},{"$f":"IFERROR(VLOOKUP(B23,'Cat 1 Setup (example to overide'!$A:$F,3,FALSE),\"\")","v":833},{"$f":"IFERROR(VLOOKUP(B23,'Cat 1 Setup (example to overide'!$A:$F,6,FALSE),\"\")","v":8729.84},{"$f":"IFERROR(E23/$E$159,\"\")","v":7.8193935980474985E-2},{"$f":"IFERROR(F23/D23,\"\")","v":0.37428571428571428},{"$f":"IFERROR(J23-L23,\"\")","v":17.52},{"$f":"IFERROR(D23/E23,\"\")","v":28},{"$f":"IFERROR(E23/$F$3,\"\")","v":0.49348341232227488},{"$f":"IFERROR(J23*H23,\"\")","v":10.48}]
["Proposed",null,{"$f":"IFERROR(IF(AND(I24>$I$160,G24>$G$160),\"Star\",IF(AND(I24>$I$160,G24<$G$160),\"Puzzle\",IF(AND(I24<$I$160,G24>$G$160),\"Plow Horse\",\"Dog\"))),\"\")","v":"Star"},{"$f":"IFERROR(IF(J24=\"\",D23,E24*J24),D23)","v":23324},{"$f":"IFERROR(IF(K24=\"\",E23,K24*$F$3),E23)","v":833},{"$f":"IFERROR(D24*H24,F23)","v":8729.84},{"$f":"IFERROR(IF(E24=\"\",G23,E24/$E$160),G23)","v":7.8193935980474985E-2},{"$f":"IFERROR(IF(L24=\"\",H23,L24/J24),H23)","v":0.37428571428571428},{"$f":"IFERROR(J24-L24,\"\")","v":17.52},{"$f":"J23","v":28},{"$f":"K23","v":0.49348341232227488},{"$f":"L23","v":10.48}]
[]
["Baseline",{"$f":"'Cat 1 Setup (example to overide'!A15","v":"ROTISSERIE DUCK"},{"$f":"IFERROR(IF(AND(I26>$I$159,G26>$G$159),\"Star\",IF(AND(I26>$I$159,G26<$G$159),\"Puzzle\",IF(AND(I26<$I$159,G26>$G$159),\"Plow Horse\",\"Dog\"))),\"\")","v":"Star"},{"$f":"IFERROR(VLOOKUP(B26,'Cat 1 Setup (example to overide'!$A:$F,4,FALSE),\"\")","v":23983},{"$f":"IFERROR(VLOOKUP(B26,'Cat 1 Setup (example to overide'!$A:$F,3,FALSE),\"\")","v":827},{"$f":"IFERROR(VLOOKUP(B26,'Cat 1 Setup (example to overide'!$A:$F,6,FALSE),\"\")","v":8774.4699999999993},{"$f":"IFERROR(E26/$E$159,\"\")","v":7.7630714352764474E-2},{"$f":"IFERROR(F26/D26,\"\")","v":0.36586206896551721},{"$f":"IFERROR(J26-L26,\"\")","v":18.39},{"$f":"IFERROR(D26/E26,\"\")","v":29},{"$f":"IFERROR(E26/$F$3,\"\")","v":0.48992890995260663},{"$f":"IFERROR(J26*H26,\"\")","v":10.61}]
["Proposed",null,{"$f":"IFERROR(IF(AND(I27>$I$160,G27>$G$160),\"Star\",IF(AND(I27>$I$160,G27<$G$160),\"Puzzle\",IF(AND(I27<$I$160,G27>$G$160),\"Plow Horse\",\"Dog\"))),\"\")","v":"Star"},{"$f":"IFERROR(IF(J27=\"\",D26,E27*J27),D26)","v":23983},{"$f":"IFERROR(IF(K27=\"\",E26,K27*$F$3),E26)","v":827},{"$f":"IFERROR(D27*H27,F26)","v":8774.4699999999993},{"$f":"IFERROR(IF(E27=\"\",G26,E27/$E$160),G26)","v":7.7630714352764474E-2},{"$f":"IFERROR(IF(L27=\"\",H26,L27/J27),H26)","v":0.36586206896551721},{"$f":"IFERROR(J27-L27,\"\")","v":18.39},{"$f":"J26","v":29},{"$f":"K26","v":0.48992890995260663},{"$f":"L26","v":10.61}]
[]
["Baseline",{"$f":"'Cat 1 Setup (example to overide'!A16","v":"NEW YORK STRIP"},{"$f":"IFERROR(IF(AND(I29>$I$159,G29>$G$159),\"Star\",IF(AND(I29>$I$159,G29<$G$159),\"Puzzle\",IF(AND(I29<$I$159,G29>$G$159),\"Plow Horse\",\"Dog\"))),\"\")","v":"Star"},{"$f":"IFERROR(VLOOKUP(B29,'Cat 1 Setup (example to overide'!$A:$F,4,FALSE),\"\")","v":26176},{"$f":"IFERROR(VLOOKUP(B29,'Cat 1 Setup (example to overide'!$A:$F,3,FALSE),\"\")","v":818},{"$f":"IFERROR(VLOOKUP(B29,'Cat 1 Setup (example to overide'!$A:$F,6,FALSE),\"\")","v":10259.9},{"$f":"IFERROR(E29/$E$159,\"\")","v":7.6785881911198728E-2},{"$f":"IFERROR(F29/D29,\"\")","v":0.39195828239608799},{"$f":"IFERROR(J29-L29,\"\")","v":19.457334963325184},{"$f":"IFERROR(D29/E29,\"\")","v":32},{"$f":"IFERROR(E29/$F$3,\"\")","v":0.48459715639810425},{"$f":"IFERROR(J29*H29,\"\")","v":12.542665036674816}]
["Proposed",null,{"$f":"IFERROR(IF(AND(I30>$I$160,G30>$G$160),\"Star\",IF(AND(I30>$I$160,G30<$G$160),\"Puzzle\",IF(AND(I30<$I$160,G30>$G$160),\"Plow Horse\",\"Dog\"))),\"\")","v":"Star"},{"$f":"IFERROR(IF(J30=\"\",D29,E30*J30),D29)","v":26176},{"$f":"IFERROR(IF(K30=\"\",E29,K30*$F$3),E29)","v":818},{"$f":"IFERROR(D30*H30,F29)","v":10259.9},{"$f":"IFERROR(IF(E30=\"\",G29,E30/$E$160),G29)","v":7.6785881911198728E-2},{"$f":"IFERROR(IF(L30=\"\",H29,L30/J30),H29)","v":0.39195828239608799},{"$f":"IFERROR(J30-L30,\"\")","v":19.457334963325184},{"$f":"J29","v":32},{"$f":"K29","v":0.48459715639810425},{"$f":"L29","v":12.542665036674816}]
[]
["Baseline",{"$f":"'Cat 1 Setup (example to overide'!A17","v":"SPAGHETTI BOLOGNESE"},{"$f":"IFERROR(IF(AND(I32>$I$159,G32>$G$159),\"Star\",IF(AND(I32>$I$159,G32<$G$159),\"Puzzle\",IF(AND(I32<$I$159,G32>$G$159),\"Plow Horse\",\"Dog\"))),\"\")","v":"Plow Horse"},{"$f":"IFERROR(VLOOKUP(B32,'Cat 1 Setup (example to overide'!$A:$F,4,FALSE),\"\")","v":9792},{"$f":"IFERROR(VLOOKUP(B32,'Cat 1 Setup (example to overide'!$A:$F,3,FALSE),\"\")","v":612},{"$f":"IFERROR(VLOOKUP(B32,'Cat 1 Setup (example to overide'!$A:$F,6,FALSE),\"\")","v":1933.92},{"$f":"IFERROR(E32/$E$159,\"\")","v":5.7448606026471415E-2},{"$f":"IFERROR(F32/D32,\"\")","v":0.19750000000000001},{"$f":"IFERROR(J32-L32,\"\")","v":12.84},{"$f":"IFERROR(D32/E32,\"\")","v":16},{"$f":"IFERROR(E32/$F$3,\"\")","v":0.36255924170616116},{"$f":"IFERROR(J32*H32,\"\")","v":3.16}]
["Proposed",null,{"$f":"IFERROR(IF(AND(I33>$I$160,G33>$G$160),\"Star\",IF(AND(I33>$I$160,G33<$G$160),\"Puzzle\",IF(AND(I33<$I$160,G33>$G$160),\"Plow Horse\",\"Dog\"))),\"\")","v":"Plow Horse"},{"$f":"IFERROR(IF(J33=\"\",D32,E33*J33),D32)","v":9792},{"$f":"IFERROR(IF(K33=\"\",E32,K33*$F$3),E32)","v":612},{"$f":"IFERROR(D33*H33,F32)","v":1933.92},{"$f":"IFERROR(IF(E33=\"\",G32,E33/$E$160),G32)","v":5.7448606026471415E-2},{"$f":"IFERROR(IF(L33=\"\",H32,L33/J33),H32)","v":0.19750000000000001},{"$f":"IFERROR(J33-L33,\"\")","v":12.84},{"$f":"J32","v":16},{"$f":"K32","v":0.36255924170616116},{"$f":"L32","v":3.16}]
[]
["Baseline",{"$f":"'Cat 1 Setup (example to overide'!A18","v":"SEARED SEA SCALLOPS"},{"$f":"IFERROR(IF(AND(I35>$I$159,G35>$G$159),\"Star\",IF(AND(I35>$I$159,G35<$G$159),\"Puzzle\",IF(AND(I35<$I$159,G35>$G$159),\"Plow Horse\",\"Dog\"))),\"\")","v":"Star"},{"$f":"IFERROR(VLOOKUP(B35,'Cat 1 Setup (example to overide'!$A:$F,4,FALSE),\"\")","v":15792},{"$f":"IFERROR(VLOOKUP(B35,'Cat 1 Setup (example to overide'!$A:$F,3,FALSE),\"\")","v":564},{"$f":"IFERROR(VLOOKUP(B35,'Cat 1 Setup (example to overide'!$A:$F,6,FALSE),\"\")","v":5306.26},{"$f":"IFERROR(E35/$E$159,\"\")","v":5.294283300478738E-2},{"$f":"IFERROR(F35/D35,\"\")","v":0.33600937183383994},{"$f":"IFERROR(J35-L35,\"\")","v":18.591737588652482},{"$f":"IFERROR(D35/E35,\"\")","v":28},{"$f":"IFERROR(E35/$F$3,\"\")","v":0.33412322274881517},{"$f":"IFERROR(J35*H35,\"\")","v":9.4082624113475184}]
["Proposed",null,{"$f":"IFERROR(IF(AND(I36>$I$160,G36>$G$160),\"Star\",IF(AND(I36>$I$160,G36<$G$160),\"Puzzle\",IF(AND(I36<$I$160,G36>$G$160),\"Plow Horse\",\"Dog\"))),\"\")","v":"Star"},{"$f":"IFERROR(IF(J36=\"\",D35,E36*J36),D35)","v":15792},{"$f":"IFERROR(IF(K36=\"\",E35,K36*$F$3),E35)","v":564},{"$f":"IFERROR(D36*H36,F35)","v":5306.26},{"$f":"IFERROR(IF(E36=\"\",G35,E36/$E$160),G35)","v":5.294283300478738E-2},{"$f":"IFERROR(IF(L36=\"\",H35,L36/J36),H35)","v":0.33600937183383994},{"$f":"IFERROR(J36-L36,\"\")","v":18.591737588652482},{"$f":"J35","v":28},{"$f":"K35","v":0.33412322274881517},{"$f":"L35","v":9.4082624113475184}]
[]
["Baseline",{"$f":"'Cat 1 Setup (example to overide'!A19","v":"OMELET"},{"$f":"IFERROR(IF(AND(I38>$I$159,G38>$G$159),\"Star\",IF(AND(I38>$I$159,G38<$G$159),\"Puzzle\",IF(AND(I38<$I$159,G38>$G$159),\"Plow Horse\",\"Dog\"))),\"\")","v":"Dog"},{"$f":"IFERROR(VLOOKUP(B38,'Cat 1 Setup (example to overide'!$A:$F,4,FALSE),\"\")","v":5564},{"$f":"IFERROR(VLOOKUP(B38,'Cat 1 Setup (example to overide'!$A:$F,3,FALSE),\"\")","v":428},{"$f":"IFERROR(VLOOKUP(B38,'Cat 1 Setup (example to overide'!$A:$F,6,FALSE),\"\")","v":1429.52},{"$f":"IFERROR(E38/$E$159,\"\")","v":4.0176476110015957E-2},{"$f":"IFERROR(F38/D38,\"\")","v":0.25692307692307692},{"$f":"IFERROR(J38-L38,\"\")","v":9.66},{"$f":"IFERROR(D38/E38,\"\")","v":13},{"$f":"IFERROR(E38/$F$3,\"\")","v":0.25355450236966826},{"$f":"IFERROR(J38*H38,\"\")","v":3.34}]
["Proposed",null,{"$f":"IFERROR(IF(AND(I39>$I$160,G39>$G$160),\"Star\",IF(AND(I39>$I$160,G39<$G$160),\"Puzzle\",IF(AND(I39<$I$160,G39>$G$160),\"Plow Horse\",\"Dog\"))),\"\")","v":"Dog"},{"$f":"IFERROR(IF(J39=\"\",D38,E39*J39),D38)","v":5564},{"$f":"IFERROR(IF(K39=\"\",E38,K39*$F$3),E38)","v":428},{"$f":"IFERROR(D39*H39,F38)","v":1429.52},{"$f":"IFERROR(IF(E39=\"\",G38,E39/$E$160),G38)","v":4.0176476110015957E-2},{"$f":"IFERROR(IF(L39=\"\",H38,L39/J39),H38)","v":0.25692307692307692},{"$f":"IFERROR(J39-L39,\"\")","v":9.66},{"$f":"J38","v":13},{"$f":"K38","v":0.25355450236966826},{"$f":"L38","v":3.34}]
[]
["Baseline",{"$f":"'Cat 1 Setup (example to overide'!A20","v":"ENTREE OF RAVIOLI"},{"$f":"IFERROR(IF(AND(I41>$I$159,G41>$G$159),\"Star\",IF(AND(I41>$I$159,G41<$G$159),\"Puzzle\",IF(AND(I41<$I$159,G41>$G$159),\"Plow Horse\",\"Dog\"))),\"\")","v":"Puzzle"},{"$f":"IFERROR(VLOOKUP(B41,'Cat 1 Setup (example to overide'!$A:$F,4,FALSE),\"\")","v":7080},{"$f":"IFERROR(VLOOKUP(B41,'Cat 1 Setup (example to overide'!$A:$F,3,FALSE),\"\")","v":354},{"$f":"IFERROR(VLOOKUP(B41,'Cat 1 Setup (example to overide'!$A:$F,6,FALSE),\"\")","v":934.56},{"$f":"IFERROR(E41/$E$159,\"\")","v":3.3230076034919738E-2},{"$f":"IFERROR(F41/D41,\"\")","v":0.13199999999999998},{"$f":"IFERROR(J41-L41,\"\")","v":17.36},{"$f":"IFERROR(D41/E41,\"\")","v":20},{"$f":"IFERROR(E41/$F$3,\"\")","v":0.20971563981042654},{"$f":"IFERROR(J41*H41,\"\")","v":2.6399999999999997}]
["Proposed",null,{"$f":"IFERROR(IF(AND(I42>$I$160,G42>$G$160),\"Star\",IF(AND(I42>$I$160,G42<$G$160),\"Puzzle\",IF(AND(I42<$I$160,G42>$G$160),\"Plow Horse\",\"Dog\"))),\"\")","v":"Puzzle"},{"$f":"IFERROR(IF(J42=\"\",D41,E42*J42),D41)","v":7080},{"$f":"IFERROR(IF(K42=\"\",E41,K42*$F$3),E41)","v":354},{"$f":"IFERROR(D42*H42,F41)","v":934.55999999999983},{"$f":"IFERROR(IF(E42=\"\",G41,E42/$E$160),G41)","v":3.3230076034919738E-2},{"$f":"IFERROR(IF(L42=\"\",H41,L42/J42),H41)","v":0.13199999999999998},{"$f":"IFERROR(J42-L42,\"\")","v":17.36},{"$f":"J41","v":20},{"$f":"K41","v":0.20971563981042654},{"$f":"L41","v":2.6399999999999997}]
[]
["Baseline",{"$f":"'Cat 1 Setup (example to overide'!A21","v":"DOVER SOLE"},{"$f":"IFERROR(IF(AND(I44>$I$159,G44>$G$159),\"Star\",IF(AND(I44>$I$159,G44<$G$159),\"Puzzle\",IF(AND(I44<$I$159,G44>$G$159),\"Plow Horse\",\"Dog\"))),\"\")","v":"Dog"},{"$f":"IFERROR(VLOOKUP(B44,'Cat 1 Setup (example to overide'!$A:$F,4,FALSE),\"\")","v":7750},{"$f":"IFERROR(VLOOKUP(B44,'Cat 1 Setup (example to overide'!$A:$F,3,FALSE),\"\")","v":250},{"$f":"IFERROR(VLOOKUP(B44,'Cat 1 Setup (example to overide'!$A:$F,6,FALSE),\"\")","v":5042.5},{"$f":"IFERROR(E44/$E$159,\"\")","v":2.3467567821271004E-2},{"$f":"IFERROR(F44/D44,\"\")","v":0.65064516129032257},{"$f":"IFERROR(J44-L44,\"\")","v":10.830000000000002},{"$f":"IFERROR(D44/E44,\"\")","v":31},{"$f":"IFERROR(E44/$F$3,\"\")","v":0.1481042654028436},{"$f":"IFERROR(J44*H44,\"\")","v":20.169999999999998}]
["Proposed",null,{"$f":"IFERROR(IF(AND(I45>$I$160,G45>$G$160),\"Star\",IF(AND(I45>$I$160,G45<$G$160),\"Puzzle\",IF(AND(I45<$I$160,G45>$G$160),\"Plow Horse\",\"Dog\"))),\"\")","v":"Dog"},{"$f":"IFERROR(IF(J45=\"\",D44,E45*J45),D44)","v":7750},{"$f":"IFERROR(IF(K45=\"\",E44,K45*$F$3),E44)","v":250},{"$f":"IFERROR(D45*H45,F44)","v":5042.5},{"$f":"IFERROR(IF(E45=\"\",G44,E45/$E$160),G44)","v":2.3467567821271004E-2},{"$f":"IFERROR(IF(L45=\"\",H44,L45/J45),H44)","v":0.65064516129032257},{"$f":"IFERROR(J45-L45,\"\")","v":10.830000000000002},{"$f":"J44","v":31},{"$f":"K44","v":0.1481042654028436},{"$f":"L44","v":20.169999999999998}]
[]
["Baseline",{"$f":"'Cat 1 Setup (example to overide'!A22","v":"LOUP DE MER"},{"$f":"IFERROR(IF(AND(I47>$I$159,G47>$G$159),\"Star\",IF(AND(I47>$I$159,G47<$G$159),\"Puzzle\",IF(AND(I47<$I$159,G47>$G$159),\"Plow Horse\",\"Dog\"))),\"\")","v":"Dog"},{"$f":"IFERROR(VLOOKUP(B47,'Cat 1 Setup (example to overide'!$A:$F,4,FALSE),\"\")","v":5564},{"$f":"IFERROR(VLOOKUP(B47,'Cat 1 Setup (example to overide'!$A:$F,3,FALSE),\"\")","v":214},{"$f":"IFERROR(VLOOKUP(B47,'Cat 1 Setup (example to overide'!$A:$F,6,FALSE),\"\")","v":2334.7399999999998},{"$f":"IFERROR(E47/$E$159,\"\")","v":2.0088238055007979E-2},{"$f":"IFERROR(F47/D47,\"\")","v":0.41961538461538456},{"$f":"IFERROR(J47-L47,\"\")","v":15.090000000000002},{"$f":"IFERROR(D47/E47,\"\")","v":26},{"$f":"IFERROR(E47/$F$3,\"\")","v":0.12677725118483413},{"$f":"IFERROR(J47*H47,\"\")","v":10.909999999999998}]
["Proposed",null,{"$f":"IFERROR(IF(AND(I48>$I$160,G48>$G$160),\"Star\",IF(AND(I48>$I$160,G48<$G$160),\"Puzzle\",IF(AND(I48<$I$160,G48>$G$160),\"Plow Horse\",\"Dog\"))),\"\")","v":"Dog"},{"$f":"IFERROR(IF(J48=\"\",D47,E48*J48),D47)","v":5564},{"$f":"IFERROR(IF(K48=\"\",E47,K48*$F$3),E47)","v":214},{"$f":"IFERROR(D48*H48,F47)","v":2334.7399999999998},{"$f":"IFERROR(IF(E48=\"\",G47,E48/$E$160),G47)","v":2.0088238055007979E-2},{"$f":"IFERROR(IF(L48=\"\",H47,L48/J48),H47)","v":0.41961538461538456},{"$f":"IFERROR(J48-L48,\"\")","v":15.090000000000002},{"$f":"J47","v":26},{"$f":"K47","v":0.12677725118483413},{"$f":"L47","v":10.909999999999998}]
[]
["Baseline",{"$f":"'Cat 1 Setup (example to overide'!A23","v":"BOUILLABAISSE"},{"$f":"IFERROR(IF(AND(I50>$I$159,G50>$G$159),\"Star\",IF(AND(I50>$I$159,G50<$G$159),\"Puzzle\",IF(AND(I50<$I$159,G50>$G$159),\"Plow Horse\",\"Dog\"))),\"\")","v":"Puzzle"},{"$f":"IFERROR(VLOOKUP(B50,'Cat 1 Setup (example to overide'!$A:$F,4,FALSE),\"\")","v":5544},{"$f":"IFERROR(VLOOKUP(B50,'Cat 1 Setup (example to overide'!$A:$F,3,FALSE),\"\")","v":198},{"$f":"IFERROR(VLOOKUP(B50,'Cat 1 Setup (example to overide'!$A:$F,6,FALSE),\"\")","v":2142.36},{"$f":"IFERROR(E50/$E$159,\"\")","v":1.8586313714446634E-2},{"$f":"IFERROR(F50/D50,\"\")","v":0.38642857142857145},{"$f":"IFERROR(J50-L50,\"\")","v":17.18},{"$f":"IFERROR(D50/E50,\"\")","v":28},{"$f":"IFERROR(E50/$F$3,\"\")","v":0.11729857819905214},{"$f":"IFERROR(J50*H50,\"\")","v":10.82}]
["Proposed",null,{"$f":"IFERROR(IF(AND(I51>$I$160,G51>$G$160),\"Star\",IF(AND(I51>$I$160,G51<$G$160),\"Puzzle\",IF(AND(I51<$I$160,G51>$G$160),\"Plow Horse\",\"Dog\"))),\"\")","v":"Puzzle"},{"$f":"IFERROR(IF(J51=\"\",D50,E51*J51),D50)","v":5544},{"$f":"IFERROR(IF(K51=\"\",E50,K51*$F$3),E50)","v":198},{"$f":"IFERROR(D51*H51,F50)","v":2142.36},{"$f":"IFERROR(IF(E51=\"\",G50,E51/$E$160),G50)","v":1.8586313714446634E-2},{"$f":"IFERROR(IF(L51=\"\",H50,L51/J51),H50)","v":0.38642857142857145},{"$f":"IFERROR(J51-L51,\"\")","v":17.18},{"$f":"J50","v":28},{"$f":"K50","v":0.11729857819905214},{"$f":"L50","v":10.82}]
[]
["Baseline",{"$f":"'Cat 1 Setup (example to overide'!A24","v":"DUNGENESS CRAB SPAGHETTI"},{"$f":"IFERROR(IF(AND(I53>$I$159,G53>$G$159),\"Star\",IF(AND(I53>$I$159,G53<$G$159),\"Puzzle\",IF(AND(I53<$I$159,G53>$G$159),\"Plow Horse\",\"Dog\"))),\"\")","v":"Puzzle"},{"$f":"IFERROR(VLOOKUP(B53,'Cat 1 Setup (example to overide'!$A:$F,4,FALSE),\"\")","v":6112},{"$f":"IFERROR(VLOOKUP(B53,'Cat 1 Setup (example to overide'!$A:$F,3,FALSE),\"\")","v":191},{"$f":"IFERROR(VLOOKUP(B53,'Cat 1 Setup (example to overide'!$A:$F,6,FALSE),\"\")","v":2175.4899999999998},{"$f":"IFERROR(E53/$E$159,\"\")","v":1.7929221815451046E-2},{"$f":"IFERROR(F53/D53,\"\")","v":0.35593749999999996},{"$f":"IFERROR(J53-L53,\"\")","v":20.61},{"$f":"IFERROR(D53/E53,\"\")","v":32},{"$f":"IFERROR(E53/$F$3,\"\")","v":0.11315165876777251},{"$f":"IFERROR(J53*H53,\"\")","v":11.389999999999999}]
["Proposed",null,{"$f":"IFERROR(IF(AND(I54>$I$160,G54>$G$160),\"Star\",IF(AND(I54>$I$160,G54<$G$160),\"Puzzle\",IF(AND(I54<$I$160,G54>$G$160),\"Plow Horse\",\"Dog\"))),\"\")","v":"Puzzle"},{"$f":"IFERROR(IF(J54=\"\",D53,E54*J54),D53)","v":6112},{"$f":"IFERROR(IF(K54=\"\",E53,K54*$F$3),E53)","v":191},{"$f":"IFERROR(D54*H54,F53)","v":2175.4899999999998},{"$f":"IFERROR(IF(E54=\"\",G53,E54/$E$160),G53)","v":1.7929221815451046E-2},{"$f":"IFERROR(IF(L54=\"\",H53,L54/J54),H53)","v":0.35593749999999996},{"$f":"IFERROR(J54-L54,\"\")","v":20.61},{"$f":"J53","v":32},{"$f":"K53","v":0.11315165876777251},{"$f":"L53","v":11.389999999999999}]
[]
["Baseline",{"$f":"'Cat 1 Setup (example to overide'!A25","v":"FARFALLE"},{"$f":"IFERROR(IF(AND(I56>$I$159,G56>$G$159),\"Star\",IF(AND(I56>$I$159,G56<$G$159),\"Puzzle\",IF(AND(I56<$I$159,G56>$G$159),\"Plow Horse\",\"Dog\"))),\"\")","v":"Dog"},{"$f":"IFERROR(VLOOKUP(B56,'Cat 1 Setup (example to overide'!$A:$F,4,FALSE),\"\")","v":2960},{"$f":"IFERROR(VLOOKUP(B56,'Cat 1 Setup (example to overide'!$A:$F,3,FALSE),\"\")","v":185},{"$f":"IFERROR(VLOOKUP(B56,'Cat 1 Setup (example to overide'!$A:$F,6,FALSE),\"\")","v":595.70000000000005},{"$f":"IFERROR(E56/$E$159,\"\")","v":1.7366000187740541E-2},{"$f":"IFERROR(F56/D56,\"\")","v":0.20125000000000001},{"$f":"IFERROR(J56-L56,\"\")","v":12.78},{"$f":"IFERROR(D56/E56,\"\")","v":16},{"$f":"IFERROR(E56/$F$3,\"\")","v":0.10959715639810426},{"$f":"IFERROR(J56*H56,\"\")","v":3.22}]
["Proposed",null,{"$f":"IFERROR(IF(AND(I57>$I$160,G57>$G$160),\"Star\",IF(AND(I57>$I$160,G57<$G$160),\"Puzzle\",IF(AND(I57<$I$160,G57>$G$160),\"Plow Horse\",\"Dog\"))),\"\")","v":"Dog"},{"$f":"IFERROR(IF(J57=\"\",D56,E57*J57),D56)","v":2960},{"$f":"IFERROR(IF(K57=\"\",E56,K57*$F$3),E56)","v":185},{"$f":"IFERROR(D57*H57,F56)","v":595.70000000000005},{"$f":"IFERROR(IF(E57=\"\",G56,E57/$E$160),G56)","v":1.7366000187740541E-2},{"$f":"IFERROR(IF(L57=\"\",H56,L57/J57),H56)","v":0.20125000000000001},{"$f":"IFERROR(J57-L57,\"\")","v":12.78},{"$f":"J56","v":16},{"$f":"K56","v":0.10959715639810426},{"$f":"L56","v":3.22}]
[]
["Baseline",{"$f":"'Cat 1 Setup (example to overide'!A26","v":"VEAL MEDALLIONS"},{"$f":"IFERROR(IF(AND(I59>$I$159,G59>$G$159),\"Star\",IF(AND(I59>$I$159,G59<$G$159),\"Puzzle\",IF(AND(I59<$I$159,G59>$G$159),\"Plow Horse\",\"Dog\"))),\"\")","v":"Puzzle"},{"$f":"IFERROR(VLOOKUP(B59,'Cat 1 Setup (example to overide'!$A:$F,4,FALSE),\"\")","v":6188},{"$f":"IFERROR(VLOOKUP(B59,'Cat 1 Setup (example to overide'!$A:$F,3,FALSE),\"\")","v":182},{"$f":"IFERROR(VLOOKUP(B59,'Cat 1 Setup (example to overide'!$A:$F,6,FALSE),\"\")","v":2305.94},{"$f":"IFERROR(E59/$E$159,\"\")","v":1.7084389373885289E-2},{"$f":"IFERROR(F59/D59,\"\")","v":0.37264705882352944},{"$f":"IFERROR(J59-L59,\"\")","v":21.33},{"$f":"IFERROR(D59/E59,\"\")","v":34},{"$f":"IFERROR(E59/$F$3,\"\")","v":0.10781990521327015},{"$f":"IFERROR(J59*H59,\"\")","v":12.670000000000002}]
["Proposed",null,{"$f":"IFERROR(IF(AND(I60>$I$160,G60>$G$160),\"Star\",IF(AND(I60>$I$160,G60<$G$160),\"Puzzle\",IF(AND(I60<$I$160,G60>$G$160),\"Plow Horse\",\"Dog\"))),\"\")","v":"Puzzle"},{"$f":"IFERROR(IF(J60=\"\",D59,E60*J60),D59)","v":6188},{"$f":"IFERROR(IF(K60=\"\",E59,K60*$F$3),E59)","v":182},{"$f":"IFERROR(D60*H60,F59)","v":2305.94},{"$f":"IFERROR(IF(E60=\"\",G59,E60/$E$160),G59)","v":1.7084389373885289E-2},{"$f":"IFERROR(IF(L60=\"\",H59,L60/J60),H59)","v":0.37264705882352944},{"$f":"IFERROR(J60-L60,\"\")","v":21.33},{"$f":"J59","v":34},{"$f":"K59","v":0.10781990521327015},{"$f":"L59","v":12.670000000000002}]
[]
["Baseline",{"$f":"'Cat 1 Setup (example to overide'!A27","v":"LOBSTER AMERICAINE"},{"$f":"IFERROR(IF(AND(I62>$I$159,G62>$G$159),\"Star\",IF(AND(I62>$I$159,G62<$G$159),\"Puzzle\",IF(AND(I62<$I$159,G62>$G$159),\"Plow Horse\",\"Dog\"))),\"\")","v":"Puzzle"},{"$f":"IFERROR(VLOOKUP(B62,'Cat 1 Setup (example to overide'!$A:$F,4,FALSE),\"\")","v":5478},{"$f":"IFERROR(VLOOKUP(B62,'Cat 1 Setup (example to overide'!$A:$F,3,FALSE),\"\")","v":166},{"$f":"IFERROR(VLOOKUP(B62,'Cat 1 Setup (example to overide'!$A:$F,6,FALSE),\"\")","v":2184.56},{"$f":"IFERROR(E62/$E$159,\"\")","v":1.5582465033323946E-2},{"$f":"IFERROR(F62/D62,\"\")","v":0.3987878787878788},{"$f":"IFERROR(J62-L62,\"\")","v":19.84},{"$f":"IFERROR(D62/E62,\"\")","v":33},{"$f":"IFERROR(E62/$F$3,\"\")","v":9.8341232227488154E-2},{"$f":"IFERROR(J62*H62,\"\")","v":13.16}]
["Proposed",null,{"$f":"IFERROR(IF(AND(I63>$I$160,G63>$G$160),\"Star\",IF(AND(I63>$I$160,G63<$G$160),\"Puzzle\",IF(AND(I63<$I$160,G63>$G$160),\"Plow Horse\",\"Dog\"))),\"\")","v":"Puzzle"},{"$f":"IFERROR(IF(J63=\"\",D62,E63*J63),D62)","v":5478},{"$f":"IFERROR(IF(K63=\"\",E62,K63*$F$3),E62)","v":166},{"$f":"IFERROR(D63*H63,F62)","v":2184.56},{"$f":"IFERROR(IF(E63=\"\",G62,E63/$E$160),G62)","v":1.5582465033323946E-2},{"$f":"IFERROR(IF(L63=\"\",H62,L63/J63),H62)","v":0.3987878787878788},{"$f":"IFERROR(J63-L63,\"\")","v":19.84},{"$f":"J62","v":33},{"$f":"K62","v":9.8341232227488154E-2},{"$f":"L62","v":13.16}]
[]
["Baseline",{"$f":"'Cat 1 Setup (example to overide'!A28","v":"PORK MILANESE"},{"$f":"IFERROR(IF(AND(I65>$I$159,G65>$G$159),\"Star\",IF(AND(I65>$I$159,G65<$G$159),\"Puzzle\",IF(AND(I65<$I$159,G65>$G$159),\"Plow Horse\",\"Dog\"))),\"\")","v":"Puzzle"},{"$f":"IFERROR(VLOOKUP(B65,'Cat 1 Setup (example to overide'!$A:$F,4,FALSE),\"\")","v":4238},{"$f":"IFERROR(VLOOKUP(B65,'Cat 1 Setup (example to overide'!$A:$F,3,FALSE),\"\")","v":163},{"$f":"IFERROR(VLOOKUP(B65,'Cat 1 Setup (example to overide'!$A:$F,6,FALSE),\"\")","v":1219.24},{"$f":"IFERROR(E65/$E$159,\"\")","v":1.5300854219468694E-2},{"$f":"IFERROR(F65/D65,\"\")","v":0.28769230769230769},{"$f":"IFERROR(J65-L65,\"\")","v":18.52},{"$f":"IFERROR(D65/E65,\"\")","v":26},{"$f":"IFERROR(E65/$F$3,\"\")","v":9.6563981042654026E-2},{"$f":"IFERROR(J65*H65,\"\")","v":7.48}]
["Proposed",null,{"$f":"IFERROR(IF(AND(I66>$I$160,G66>$G$160),\"Star\",IF(AND(I66>$I$160,G66<$G$160),\"Puzzle\",IF(AND(I66<$I$160,G66>$G$160),\"Plow Horse\",\"Dog\"))),\"\")","v":"Puzzle"},{"$f":"IFERROR(IF(J66=\"\",D65,E66*J66),D65)","v":4238},{"$f":"IFERROR(IF(K66=\"\",E65,K66*$F$3),E65)","v":163},{"$f":"IFERROR(D66*H66,F65)","v":1219.24},{"$f":"IFERROR(IF(E66=\"\",G65,E66/$E$160),G65)","v":1.5300854219468694E-2},{"$f":"IFERROR(IF(L66=\"\",H65,L66/J66),H65)","v":0.28769230769230769},{"$f":"IFERROR(J66-L66,\"\")","v":18.52},{"$f":"J65","v":26},{"$f":"K65","v":9.6563981042654026E-2},{"$f":"L65","v":7.48}]
[]
["Baseline",{"$f":"'Cat 1 Setup (example to overide'!A29","v":0},{"$f":"IFERROR(IF(AND(I68>$I$159,G68>$G$159),\"Star\",IF(AND(I68>$I$159,G68<$G$159),\"Puzzle\",IF(AND(I68<$I$159,G68>$G$159),\"Plow Horse\",\"Dog\"))),\"\")","v":"Puzzle"},{"$f":"IFERROR(VLOOKUP(B68,'Cat 1 Setup (example to overide'!$A:$F,4,FALSE),\"\")","v":0},{"$f":"IFERROR(VLOOKUP(B68,'Cat 1 Setup (example to overide'!$A:$F,3,FALSE),\"\")","v":0},{"$f":"IFERROR(VLOOKUP(B68,'Cat 1 Setup (example to overide'!$A:$F,6,FALSE),\"\")","v":0},{"$f":"IFERROR(E68/$E$159,\"\")","v":0},{"$f":"IFERROR(F68/D68,\"\")","v":""},{"$f":"IFERROR(J68-L68,\"\")","v":""},{"$f":"IFERROR(D68/E68,\"\")","v":""},{"$f":"IFERROR(E68/$F$3,\"\")","v":0},{"$f":"IFERROR(J68*H68,\"\")","v":""}]
["Proposed",null,{"$f":"IFERROR(IF(AND(I69>$I$160,G69>$G$160),\"Star\",IF(AND(I69>$I$160,G69<$G$160),\"Puzzle\",IF(AND(I69<$I$160,G69>$G$160),\"Plow Horse\",\"Dog\"))),\"\")","v":"Puzzle"},{"$f":"IFERROR(IF(J69=\"\",D68,E69*J69),D68)","v":0},{"$f":"IFERROR(IF(K69=\"\",E68,K69*$F$3),E68)","v":0},{"$f":"IFERROR(D69*H69,F68)","v":0},{"$f":"IFERROR(IF(E69=\"\",G68,E69/$E$160),G68)","v":0},{"$f":"IFERROR(IF(L69=\"\",H68,L69/J69),H68)","v":""},{"$f":"IFERROR(J69-L69,\"\")","v":""},{"$f":"J68","v":""},{"$f":"K68","v":0},{"$f":"L68","v":""}]
[]
["Baseline",{"$f":"'Cat 1 Setup (example to overide'!A30","v":0},{"$f":"IFERROR(IF(AND(I71>$I$159,G71>$G$159),\"Star\",IF(AND(I71>$I$159,G71<$G$159),\"Puzzle\",IF(AND(I71<$I$159,G71>$G$159),\"Plow Horse\",\"Dog\"))),\"\")","v":"Puzzle"},{"$f":"IFERROR(VLOOKUP(B71,'Cat 1 Setup (example to overide'!$A:$F,4,FALSE),\"\")","v":0},{"$f":"IFERROR(VLOOKUP(B71,'Cat 1 Setup (example to overide'!$A:$F,3,FALSE),\"\")","v":0},{"$f":"IFERROR(VLOOKUP(B71,'Cat 1 Setup (example to overide'!$A:$F,6,FALSE),\"\")","v":0},{"$f":"IFERROR(E71/$E$159,\"\")","v":0},{"$f":"IFERROR(F71/D71,\"\")","v":""},{"$f":"IFERROR(J71-L71,\"\")","v":""},{"$f":"IFERROR(D71/E71,\"\")","v":""},{"$f":"IFERROR(E71/$F$3,\"\")","v":0},{"$f":"IFERROR(J71*H71,\"\")","v":""}]
["Proposed",null,{"$f":"IFERROR(IF(AND(I72>$I$160,G72>$G$160),\"Star\",IF(AND(I72>$I$160,G72<$G$160),\"Puzzle\",IF(AND(I72<$I$160,G72>$G$160),\"Plow Horse\",\"Dog\"))),\"\")","v":"Puzzle"},{"$f":"IFERROR(IF(J72=\"\",D71,E72*J72),D71)","v":0},{"$f":"IFERROR(IF(K72=\"\",E71,K72*$F$3),E71)","v":0},{"$f":"IFERROR(D72*H72,F71)","v":0},{"$f":"IFERROR(IF(E72=\"\",G71,E72/$E$160),G71)","v":0},{"$f":"IFERROR(IF(L72=\"\",H71,L72/J72),H71)","v":""},{"$f":"IFERROR(J72-L72,\"\")","v":""},{"$f":"J71","v":""},{"$f":"K71","v":0},{"$f":"L71","v":""}]
[]
["Baseline",{"$f":"'Cat 1 Setup (example to overide'!A31","v":0},{"$f":"IFERROR(IF(AND(I74>$I$159,G74>$G$159),\"Star\",IF(AND(I74>$I$159,G74<$G$159),\"Puzzle\",IF(AND(I74<$I$159,G74>$G$159),\"Plow Horse\",\"Dog\"))),\"\")","v":"Puzzle"},{"$f":"IFERROR(VLOOKUP(B74,'Cat 1 Setup (example to overide'!$A:$F,4,FALSE),\"\")","v":0},{"$f":"IFERROR(VLOOKUP(B74,'Cat 1 Setup (example to overide'!$A:$F,3,FALSE),\"\")","v":0},{"$f":"IFERROR(VLOOKUP(B74,'Cat 1 Setup (example to overide'!$A:$F,6,FALSE),\"\")","v":0},{"$f":"IFERROR(E74/$E$159,\"\")","v":0},{"$f":"IFERROR(F74/D74,\"\")","v":""},{"$f":"IFERROR(J74-L74,\"\")","v":""},{"$f":"IFERROR(D74/E74,\"\")","v":""},{"$f":"IFERROR(E74/$F$3,\"\")","v":0},{"$f":"IFERROR(J74*H74,\"\")","v":""}]
["Proposed",null,{"$f":"IFERROR(IF(AND(I75>$I$160,G75>$G$160),\"Star\",IF(AND(I75>$I$160,G75<$G$160),\"Puzzle\",IF(AND(I75<$I$160,G75>$G$160),\"Plow Horse\",\"Dog\"))),\"\")","v":"Puzzle"},{"$f":"IFERROR(IF(J75=\"\",D74,E75*J75),D74)","v":0},{"$f":"IFERROR(IF(K75=\"\",E74,K75*$F$3),E74)","v":0},{"$f":"IFERROR(D75*H75,F74)","v":0},{"$f":"IFERROR(IF(E75=\"\",G74,E75/$E$160),G74)","v":0},{"$f":"IFERROR(IF(L75=\"\",H74,L75/J75),H74)","v":""},{"$f":"IFERROR(J75-L75,\"\")","v":""},{"$f":"J74","v":""},{"$f":"K74","v":0},{"$f":"L74","v":""}]
[]
["Baseline",{"$f":"'Cat 1 Setup (example to overide'!A32","v":0},{"$f":"IFERROR(IF(AND(I77>$I$159,G77>$G$159),\"Star\",IF(AND(I77>$I$159,G77<$G$159),\"Puzzle\",IF(AND(I77<$I$159,G77>$G$159),\"Plow Horse\",\"Dog\"))),\"\")","v":"Puzzle"},{"$f":"IFERROR(VLOOKUP(B77,'Cat 1 Setup (example to overide'!$A:$F,4,FALSE),\"\")","v":0},{"$f":"IFERROR(VLOOKUP(B77,'Cat 1 Setup (example to overide'!$A:$F,3,FALSE),\"\")","v":0},{"$f":"IFERROR(VLOOKUP(B77,'Cat 1 Setup (example to overide'!$A:$F,6,FALSE),\"\")","v":0},{"$f":"IFERROR(E77/$E$159,\"\")","v":0},{"$f":"IFERROR(F77/D77,\"\")","v":""},{"$f":"IFERROR(J77-L77,\"\")","v":""},{"$f":"IFERROR(D77/E77,\"\")","v":""},{"$f":"IFERROR(E77/$F$3,\"\")","v":0},{"$f":"IFERROR(J77*H77,\"\")","v":""}]
["Proposed",null,{"$f":"IFERROR(IF(AND(I78>$I$160,G78>$G$160),\"Star\",IF(AND(I78>$I$160,G78<$G$160),\"Puzzle\",IF(AND(I78<$I$160,G78>$G$160),\"Plow Horse\",\"Dog\"))),\"\")","v":"Puzzle"},{"$f":"IFERROR(IF(J78=\"\",D77,E78*J78),D77)","v":0},{"$f":"IFERROR(IF(K78=\"\",E77,K78*$F$3),E77)","v":0},{"$f":"IFERROR(D78*H78,F77)","v":0},{"$f":"IFERROR(IF(E78=\"\",G77,E78/$E$160),G77)","v":0},{"$f":"IFERROR(IF(L78=\"\",H77,L78/J78),H77)","v":""},{"$f":"IFERROR(J78-L78,\"\")","v":""},{"$f":"J77","v":""},{"$f":"K77","v":0},{"$f":"L77","v":""}]
[]
["Baseline",{"$f":"'Cat 1 Setup (example to overide'!A33","v":0},{"$f":"IFERROR(IF(AND(I80>$I$159,G80>$G$159),\"Star\",IF(AND(I80>$I$159,G80<$G$159),\"Puzzle\",IF(AND(I80<$I$159,G80>$G$159),\"Plow Horse\",\"Dog\"))),\"\")","v":"Puzzle"},{"$f":"IFERROR(VLOOKUP(B80,'Cat 1 Setup (example to overide'!$A:$F,4,FALSE),\"\")","v":0},{"$f":"IFERROR(VLOOKUP(B80,'Cat 1 Setup (example to overide'!$A:$F,3,FALSE),\"\")","v":0},{"$f":"IFERROR(VLOOKUP(B80,'Cat 1 Setup (example to overide'!$A:$F,6,FALSE),\"\")","v":0},{"$f":"IFERROR(E80/$E$159,\"\")","v":0},{"$f":"IFERROR(F80/D80,\"\")","v":""},{"$f":"IFERROR(J80-L80,\"\")","v":""},{"$f":"IFERROR(D80/E80,\"\")","v":""},{"$f":"IFERROR(E80/$F$3,\"\")","v":0},{"$f":"IFERROR(J80*H80,\"\")","v":""}]
["Proposed",null,{"$f":"IFERROR(IF(AND(I81>$I$160,G81>$G$160),\"Star\",IF(AND(I81>$I$160,G81<$G$160),\"Puzzle\",IF(AND(I81<$I$160,G81>$G$160),\"Plow Horse\",\"Dog\"))),\"\")","v":"Puzzle"},{"$f":"IFERROR(IF(J81=\"\",D80,E81*J81),D80)","v":0},{"$f":"IFERROR(IF(K81=\"\",E80,K81*$F$3),E80)","v":0},{"$f":"IFERROR(D81*H81,F80)","v":0},{"$f":"IFERROR(IF(E81=\"\",G80,E81/$E$160),G80)","v":0},{"$f":"IFERROR(IF(L81=\"\",H80,L81/J81),H80)","v":""},{"$f":"IFERROR(J81-L81,\"\")","v":""},{"$f":"J80","v":""},{"$f":"K80","v":0},{"$f":"L80","v":""}]
[]
["Baseline",{"$f":"'Cat 1 Setup (example to overide'!A34","v":0},{"$f":"IFERROR(IF(AND(I83>$I$159,G83>$G$159),\"Star\",IF(AND(I83>$I$159,G83<$G$159),\"Puzzle\",IF(AND(I83<$I$159,G83>$G$159),\"Plow Horse\",\"Dog\"))),\"\")","v":"Puzzle"},{"$f":"IFERROR(VLOOKUP(B83,'Cat 1 Setup (example to overide'!$A:$F,4,FALSE),\"\")","v":0},{"$f":"IFERROR(VLOOKUP(B83,'Cat 1 Setup (example to overide'!$A:$F,3,FALSE),\"\")","v":0},{"$f":"IFERROR(VLOOKUP(B83,'Cat 1 Setup (example to overide'!$A:$F,6,FALSE),\"\")","v":0},{"$f":"IFERROR(E83/$E$159,\"\")","v":0},{"$f":"IFERROR(F83/D83,\"\")","v":""},{"$f":"IFERROR(J83-L83,\"\")","v":""},{"$f":"IFERROR(D83/E83,\"\")","v":""},{"$f":"IFERROR(E83/$F$3,\"\")","v":0},{"$f":"IFERROR(J83*H83,\"\")","v":""}]
["Proposed",null,{"$f":"IFERROR(IF(AND(I84>$I$160,G84>$G$160),\"Star\",IF(AND(I84>$I$160,G84<$G$160),\"Puzzle\",IF(AND(I84<$I$160,G84>$G$160),\"Plow Horse\",\"Dog\"))),\"\")","v":"Puzzle"},{"$f":"IFERROR(IF(J84=\"\",D83,E84*J84),D83)","v":0},{"$f":"IFERROR(IF(K84=\"\",E83,K84*$F$3),E83)","v":0},{"$f":"IFERROR(D84*H84,F83)","v":0},{"$f":"IFERROR(IF(E84=\"\",G83,E84/$E$160),G83)","v":0},{"$f":"IFERROR(IF(L84=\"\",H83,L84/J84),H83)","v":""},{"$f":"IFERROR(J84-L84,\"\")","v":""},{"$f":"J83","v":""},{"$f":"K83","v":0},{"$f":"L83","v":""}]
[]
["Baseline",{"$f":"'Cat 1 Setup (example to overide'!A35","v":0},{"$f":"IFERROR(IF(AND(I86>$I$159,G86>$G$159),\"Star\",IF(AND(I86>$I$159,G86<$G$159),\"Puzzle\",IF(AND(I86<$I$159,G86>$G$159),\"Plow Horse\",\"Dog\"))),\"\")","v":"Puzzle"},{"$f":"IFERROR(VLOOKUP(B86,'Cat 1 Setup (example to overide'!$A:$F,4,FALSE),\"\")","v":0},{"$f":"IFERROR(VLOOKUP(B86,'Cat 1 Setup (example to overide'!$A:$F,3,FALSE),\"\")","v":0},{"$f":"IFERROR(VLOOKUP(B86,'Cat 1 Setup (example to overide'!$A:$F,6,FALSE),\"\")","v":0},{"$f":"IFERROR(E86/$E$159,\"\")","v":0},{"$f":"IFERROR(F86/D86,\"\")","v":""},{"$f":"IFERROR(J86-L86,\"\")","v":""},{"$f":"IFERROR(D86/E86,\"\")","v":""},{"$f":"IFERROR(E86/$F$3,\"\")","v":0},{"$f":"IFERROR(J86*H86,\"\")","v":""}]
["Proposed",null,{"$f":"IFERROR(IF(AND(I87>$I$160,G87>$G$160),\"Star\",IF(AND(I87>$I$160,G87<$G$160),\"Puzzle\",IF(AND(I87<$I$160,G87>$G$160),\"Plow Horse\",\"Dog\"))),\"\")","v":"Puzzle"},{"$f":"IFERROR(IF(J87=\"\",D86,E87*J87),D86)","v":0},{"$f":"IFERROR(IF(K87=\"\",E86,K87*$F$3),E86)","v":0},{"$f":"IFERROR(D87*H87,F86)","v":0},{"$f":"IFERROR(IF(E87=\"\",G86,E87/$E$160),G86)","v":0},{"$f":"IFERROR(IF(L87=\"\",H86,L87/J87),H86)","v":""},{"$f":"IFERROR(J87-L87,\"\")","v":""},{"$f":"J86","v":""},{"$f":"K86","v":0},{"$f":"L86","v":""}]
[]
["Baseline",{"$f":"'Cat 1 Setup (example to overide'!A36","v":0},{"$f":"IFERROR(IF(AND(I89>$I$159,G89>$G$159),\"Star\",IF(AND(I89>$I$159,G89<$G$159),\"Puzzle\",IF(AND(I89<$I$159,G89>$G$159),\"Plow Horse\",\"Dog\"))),\"\")","v":"Puzzle"},{"$f":"IFERROR(VLOOKUP(B89,'Cat 1 Setup (example to overide'!$A:$F,4,FALSE),\"\")","v":0},{"$f":"IFERROR(VLOOKUP(B89,'Cat 1 Setup (example to overide'!$A:$F,3,FALSE),\"\")","v":0},{"$f":"IFERROR(VLOOKUP(B89,'Cat 1 Setup (example to overide'!$A:$F,6,FALSE),\"\")","v":0},{"$f":"IFERROR(E89/$E$159,\"\")","v":0},{"$f":"IFERROR(F89/D89,\"\")","v":""},{"$f":"IFERROR(J89-L89,\"\")","v":""},{"$f":"IFERROR(D89/E89,\"\")","v":""},{"$f":"IFERROR(E89/$F$3,\"\")","v":0},{"$f":"IFERROR(J89*H89,\"\")","v":""}]
["Proposed",null,{"$f":"IFERROR(IF(AND(I90>$I$160,G90>$G$160),\"Star\",IF(AND(I90>$I$160,G90<$G$160),\"Puzzle\",IF(AND(I90<$I$160,G90>$G$160),\"Plow Horse\",\"Dog\"))),\"\")","v":"Puzzle"},{"$f":"IFERROR(IF(J90=\"\",D89,E90*J90),D89)","v":0},{"$f":"IFERROR(IF(K90=\"\",E89,K90*$F$3),E89)","v":0},{"$f":"IFERROR(D90*H90,F89)","v":0},{"$f":"IFERROR(IF(E90=\"\",G89,E90/$E$160),G89)","v":0},{"$f":"IFERROR(IF(L90=\"\",H89,L90/J90),H89)","v":""},{"$f":"IFERROR(J90-L90,\"\")","v":""},{"$f":"J89","v":""},{"$f":"K89","v":0},{"$f":"L89","v":""}]
[]
["Baseline",{"$f":"'Cat 1 Setup (example to overide'!A37","v":0},{"$f":"IFERROR(IF(AND(I92>$I$159,G92>$G$159),\"Star\",IF(AND(I92>$I$159,G92<$G$159),\"Puzzle\",IF(AND(I92<$I$159,G92>$G$159),\"Plow Horse\",\"Dog\"))),\"\")","v":"Puzzle"},{"$f":"IFERROR(VLOOKUP(B92,'Cat 1 Setup (example to overide'!$A:$F,4,FALSE),\"\")","v":0},{"$f":"IFERROR(VLOOKUP(B92,'Cat 1 Setup (example to overide'!$A:$F,3,FALSE),\"\")","v":0},{"$f":"IFERROR(VLOOKUP(B92,'Cat 1 Setup (example to overide'!$A:$F,6,FALSE),\"\")","v":0},{"$f":"IFERROR(E92/$E$159,\"\")","v":0},{"$f":"IFERROR(F92/D92,\"\")","v":""},{"$f":"IFERROR(J92-L92,\"\")","v":""},{"$f":"IFERROR(D92/E92,\"\")","v":""},{"$f":"IFERROR(E92/$F$3,\"\")","v":0},{"$f":"IFERROR(J92*H92,\"\")","v":""}]
["Proposed",null,{"$f":"IFERROR(IF(AND(I93>$I$160,G93>$G$160),\"Star\",IF(AND(I93>$I$160,G93<$G$160),\"Puzzle\",IF(AND(I93<$I$160,G93>$G$160),\"Plow Horse\",\"Dog\"))),\"\")","v":"Puzzle"},{"$f":"IFERROR(IF(J93=\"\",D92,E93*J93),D92)","v":0},{"$f":"IFERROR(IF(K93=\"\",E92,K93*$F$3),E92)","v":0},{"$f":"IFERROR(D93*H93,F92)","v":0},{"$f":"IFERROR(IF(E93=\"\",G92,E93/$E$160),G92)","v":0},{"$f":"IFERROR(IF(L93=\"\",H92,L93/J93),H92)","v":""},{"$f":"IFERROR(J93-L93,\"\")","v":""},{"$f":"J92","v":""},{"$f":"K92","v":0},{"$f":"L92","v":""}]
[]
["Baseline",{"$f":"'Cat 1 Setup (example to overide'!A38","v":0},{"$f":"IFERROR(IF(AND(I95>$I$159,G95>$G$159),\"Star\",IF(AND(I95>$I$159,G95<$G$159),\"Puzzle\",IF(AND(I95<$I$159,G95>$G$159),\"Plow Horse\",\"Dog\"))),\"\")","v":"Puzzle"},{"$f":"IFERROR(VLOOKUP(B95,'Cat 1 Setup (example to overide'!$A:$F,4,FALSE),\"\")","v":0},{"$f":"IFERROR(VLOOKUP(B95,'Cat 1 Setup (example to overide'!$A:$F,3,FALSE),\"\")","v":0},{"$f":"IFERROR(VLOOKUP(B95,'Cat 1 Setup (example to overide'!$A:$F,6,FALSE),\"\")","v":0},{"$f":"IFERROR(E95/$E$159,\"\")","v":0},{"$f":"IFERROR(F95/D95,\"\")","v":""},{"$f":"IFERROR(J95-L95,\"\")","v":""},{"$f":"IFERROR(D95/E95,\"\")","v":""},{"$f":"IFERROR(E95/$F$3,\"\")","v":0},{"$f":"IFERROR(J95*H95,\"\")","v":""}]
["Proposed",null,{"$f":"IFERROR(IF(AND(I96>$I$160,G96>$G$160),\"Star\",IF(AND(I96>$I$160,G96<$G$160),\"Puzzle\",IF(AND(I96<$I$160,G96>$G$160),\"Plow Horse\",\"Dog\"))),\"\")","v":"Puzzle"},{"$f":"IFERROR(IF(J96=\"\",D95,E96*J96),D95)","v":0},{"$f":"IFERROR(IF(K96=\"\",E95,K96*$F$3),E95)","v":0},{"$f":"IFERROR(D96*H96,F95)","v":0},{"$f":"IFERROR(IF(E96=\"\",G95,E96/$E$160),G95)","v":0},{"$f":"IFERROR(IF(L96=\"\",H95,L96/J96),H95)","v":""},{"$f":"IFERROR(J96-L96,\"\")","v":""},{"$f":"J95","v":""},{"$f":"K95","v":0},{"$f":"L95","v":""}]
[]
["Baseline",{"$f":"'Cat 1 Setup (example to overide'!A39","v":0},{"$f":"IFERROR(IF(AND(I98>$I$159,G98>$G$159),\"Star\",IF(AND(I98>$I$159,G98<$G$159),\"Puzzle\",IF(AND(I98<$I$159,G98>$G$159),\"Plow Horse\",\"Dog\"))),\"\")","v":"Puzzle"},{"$f":"IFERROR(VLOOKUP(B98,'Cat 1 Setup (example to overide'!$A:$F,4,FALSE),\"\")","v":0},{"$f":"IFERROR(VLOOKUP(B98,'Cat 1 Setup (example to overide'!$A:$F,3,FALSE),\"\")","v":0},{"$f":"IFERROR(VLOOKUP(B98,'Cat 1 Setup (example to overide'!$A:$F,6,FALSE),\"\")","v":0},{"$f":"IFERROR(E98/$E$159,\"\")","v":0},{"$f":"IFERROR(F98/D98,\"\")","v":""},{"$f":"IFERROR(J98-L98,\"\")","v":""},{"$f":"IFERROR(D98/E98,\"\")","v":""},{"$f":"IFERROR(E98/$F$3,\"\")","v":0},{"$f":"IFERROR(J98*H98,\"\")","v":""}]
["Proposed",null,{"$f":"IFERROR(IF(AND(I99>$I$160,G99>$G$160),\"Star\",IF(AND(I99>$I$160,G99<$G$160),\"Puzzle\",IF(AND(I99<$I$160,G99>$G$160),\"Plow Horse\",\"Dog\"))),\"\")","v":"Puzzle"},{"$f":"IFERROR(IF(J99=\"\",D98,E99*J99),D98)","v":0},{"$f":"IFERROR(IF(K99=\"\",E98,K99*$F$3),E98)","v":0},{"$f":"IFERROR(D99*H99,F98)","v":0},{"$f":"IFERROR(IF(E99=\"\",G98,E99/$E$160),G98)","v":0},{"$f":"IFERROR(IF(L99=\"\",H98,L99/J99),H98)","v":""},{"$f":"IFERROR(J99-L99,\"\")","v":""},{"$f":"J98","v":""},{"$f":"K98","v":0},{"$f":"L98","v":""}]
[]
["Baseline",{"$f":"'Cat 1 Setup (example to overide'!A40","v":0},{"$f":"IFERROR(IF(AND(I101>$I$159,G101>$G$159),\"Star\",IF(AND(I101>$I$159,G101<$G$159),\"Puzzle\",IF(AND(I101<$I$159,G101>$G$159),\"Plow Horse\",\"Dog\"))),\"\")","v":"Puzzle"},{"$f":"IFERROR(VLOOKUP(B101,'Cat 1 Setup (example to overide'!$A:$F,4,FALSE),\"\")","v":0},{"$f":"IFERROR(VLOOKUP(B101,'Cat 1 Setup (example to overide'!$A:$F,3,FALSE),\"\")","v":0},{"$f":"IFERROR(VLOOKUP(B101,'Cat 1 Setup (example to overide'!$A:$F,6,FALSE),\"\")","v":0},{"$f":"IFERROR(E101/$E$159,\"\")","v":0},{"$f":"IFERROR(F101/D101,\"\")","v":""},{"$f":"IFERROR(J101-L101,\"\")","v":""},{"$f":"IFERROR(D101/E101,\"\")","v":""},{"$f":"IFERROR(E101/$F$3,\"\")","v":0},{"$f":"IFERROR(J101*H101,\"\")","v":""}]
["Proposed",null,{"$f":"IFERROR(IF(AND(I102>$I$160,G102>$G$160),\"Star\",IF(AND(I102>$I$160,G102<$G$160),\"Puzzle\",IF(AND(I102<$I$160,G102>$G$160),\"Plow Horse\",\"Dog\"))),\"\")","v":"Puzzle"},{"$f":"IFERROR(IF(J102=\"\",D101,E102*J102),D101)","v":0},{"$f":"IFERROR(IF(K102=\"\",E101,K102*$F$3),E101)","v":0},{"$f":"IFERROR(D102*H102,F101)","v":0},{"$f":"IFERROR(IF(E102=\"\",G101,E102/$E$160),G101)","v":0},{"$f":"IFERROR(IF(L102=\"\",H101,L102/J102),H101)","v":""},{"$f":"IFERROR(J102-L102,\"\")","v":""},{"$f":"J101","v":""},{"$f":"K101","v":0},{"$f":"L101","v":""}]
[]
["Baseline",{"$f":"'Cat 1 Setup (example to overide'!A41","v":0},{"$f":"IFERROR(IF(AND(I104>$I$159,G104>$G$159),\"Star\",IF(AND(I104>$I$159,G104<$G$159),\"Puzzle\",IF(AND(I104<$I$159,G104>$G$159),\"Plow Horse\",\"Dog\"))),\"\")","v":"Puzzle"},{"$f":"IFERROR(VLOOKUP(B104,'Cat 1 Setup (example to overide'!$A:$F,4,FALSE),\"\")","v":0},{"$f":"IFERROR(VLOOKUP(B104,'Cat 1 Setup (example to overide'!$A:$F,3,FALSE),\"\")","v":0},{"$f":"IFERROR(VLOOKUP(B104,'Cat 1 Setup (example to overide'!$A:$F,6,FALSE),\"\")","v":0},{"$f":"IFERROR(E104/$E$159,\"\")","v":0},{"$f":"IFERROR(F104/D104,\"\")","v":""},{"$f":"IFERROR(J104-L104,\"\")","v":""},{"$f":"IFERROR(D104/E104,\"\")","v":""},{"$f":"IFERROR(E104/$F$3,\"\")","v":0},{"$f":"IFERROR(J104*H104,\"\")","v":""}]
["Proposed",null,{"$f":"IFERROR(IF(AND(I105>$I$160,G105>$G$160),\"Star\",IF(AND(I105>$I$160,G105<$G$160),\"Puzzle\",IF(AND(I105<$I$160,G105>$G$160),\"Plow Horse\",\"Dog\"))),\"\")","v":"Puzzle"},{"$f":"IFERROR(IF(J105=\"\",D104,E105*J105),D104)","v":0},{"$f":"IFERROR(IF(K105=\"\",E104,K105*$F$3),E104)","v":0},{"$f":"IFERROR(D105*H105,F104)","v":0},{"$f":"IFERROR(IF(E105=\"\",G104,E105/$E$160),G104)","v":0},{"$f":"IFERROR(IF(L105=\"\",H104,L105/J105),H104)","v":""},{"$f":"IFERROR(J105-L105,\"\")","v":""},{"$f":"J104","v":""},{"$f":"K104","v":0},{"$f":"L104","v":""}]
[]
["Baseline",{"$f":"'Cat 1 Setup (example to overide'!A42","v":0},{"$f":"IFERROR(IF(AND(I107>$I$159,G107>$G$159),\"Star\",IF(AND(I107>$I$159,G107<$G$159),\"Puzzle\",IF(AND(I107<$I$159,G107>$G$159),\"Plow Horse\",\"Dog\"))),\"\")","v":"Puzzle"},{"$f":"IFERROR(VLOOKUP(B107,'Cat 1 Setup (example to overide'!$A:$F,4,FALSE),\"\")","v":0},{"$f":"IFERROR(VLOOKUP(B107,'Cat 1 Setup (example to overide'!$A:$F,3,FALSE),\"\")","v":0},{"$f":"IFERROR(VLOOKUP(B107,'Cat 1 Setup (example to overide'!$A:$F,6,FALSE),\"\")","v":0},{"$f":"IFERROR(E107/$E$159,\"\")","v":0},{"$f":"IFERROR(F107/D107,\"\")","v":""},{"$f":"IFERROR(J107-L107,\"\")","v":""},{"$f":"IFERROR(D107/E107,\"\")","v":""},{"$f":"IFERROR(E107/$F$3,\"\")","v":0},{"$f":"IFERROR(J107*H107,\"\")","v":""}]
["Proposed",null,{"$f":"IFERROR(IF(AND(I108>$I$160,G108>$G$160),\"Star\",IF(AND(I108>$I$160,G108<$G$160),\"Puzzle\",IF(AND(I108<$I$160,G108>$G$160),\"Plow Horse\",\"Dog\"))),\"\")","v":"Puzzle"},{"$f":"IFERROR(IF(J108=\"\",D107,E108*J108),D107)","v":0},{"$f":"IFERROR(IF(K108=\"\",E107,K108*$F$3),E107)","v":0},{"$f":"IFERROR(D108*H108,F107)","v":0},{"$f":"IFERROR(IF(E108=\"\",G107,E108/$E$160),G107)","v":0},{"$f":"IFERROR(IF(L108=\"\",H107,L108/J108),H107)","v":""},{"$f":"IFERROR(J108-L108,\"\")","v":""},{"$f":"J107","v":""},{"$f":"K107","v":0},{"$f":"L107","v":""}]
[]
["Baseline",{"$f":"'Cat 1 Setup (example to overide'!A43","v":0},{"$f":"IFERROR(IF(AND(I110>$I$159,G110>$G$159),\"Star\",IF(AND(I110>$I$159,G110<$G$159),\"Puzzle\",IF(AND(I110<$I$159,G110>$G$159),\"Plow Horse\",\"Dog\"))),\"\")","v":"Puzzle"},{"$f":"IFERROR(VLOOKUP(B110,'Cat 1 Setup (example to overide'!$A:$F,4,FALSE),\"\")","v":0},{"$f":"IFERROR(VLOOKUP(B110,'Cat 1 Setup (example to overide'!$A:$F,3,FALSE),\"\")","v":0},{"$f":"IFERROR(VLOOKUP(B110,'Cat 1 Setup (example to overide'!$A:$F,6,FALSE),\"\")","v":0},{"$f":"IFERROR(E110/$E$159,\"\")","v":0},{"$f":"IFERROR(F110/D110,\"\")","v":""},{"$f":"IFERROR(J110-L110,\"\")","v":""},{"$f":"IFERROR(D110/E110,\"\")","v":""},{"$f":"IFERROR(E110/$F$3,\"\")","v":0},{"$f":"IFERROR(J110*H110,\"\")","v":""}]
["Proposed",null,{"$f":"IFERROR(IF(AND(I111>$I$160,G111>$G$160),\"Star\",IF(AND(I111>$I$160,G111<$G$160),\"Puzzle\",IF(AND(I111<$I$160,G111>$G$160),\"Plow Horse\",\"Dog\"))),\"\")","v":"Puzzle"},{"$f":"IFERROR(IF(J111=\"\",D110,E111*J111),D110)","v":0},{"$f":"IFERROR(IF(K111=\"\",E110,K111*$F$3),E110)","v":0},{"$f":"IFERROR(D111*H111,F110)","v":0},{"$f":"IFERROR(IF(E111=\"\",G110,E111/$E$160),G110)","v":0},{"$f":"IFERROR(IF(L111=\"\",H110,L111/J111),H110)","v":""},{"$f":"IFERROR(J111-L111,\"\")","v":""},{"$f":"J110","v":""},{"$f":"K110","v":0},{"$f":"L110","v":""}]
[]
["Baseline",{"$f":"'Cat 1 Setup (example to overide'!A44","v":0},{"$f":"IFERROR(IF(AND(I113>$I$159,G113>$G$159),\"Star\",IF(AND(I113>$I$159,G113<$G$159),\"Puzzle\",IF(AND(I113<$I$159,G113>$G$159),\"Plow Horse\",\"Dog\"))),\"\")","v":"Puzzle"},{"$f":"IFERROR(VLOOKUP(B113,'Cat 1 Setup (example to overide'!$A:$F,4,FALSE),\"\")","v":0},{"$f":"IFERROR(VLOOKUP(B113,'Cat 1 Setup (example to overide'!$A:$F,3,FALSE),\"\")","v":0},{"$f":"IFERROR(VLOOKUP(B113,'Cat 1 Setup (example to overide'!$A:$F,6,FALSE),\"\")","v":0},{"$f":"IFERROR(E113/$E$159,\"\")","v":0},{"$f":"IFERROR(F113/D113,\"\")","v":""},{"$f":"IFERROR(J113-L113,\"\")","v":""},{"$f":"IFERROR(D113/E113,\"\")","v":""},{"$f":"IFERROR(E113/$F$3,\"\")","v":0},{"$f":"IFERROR(J113*H113,\"\")","v":""}]
["Proposed",null,{"$f":"IFERROR(IF(AND(I114>$I$160,G114>$G$160),\"Star\",IF(AND(I114>$I$160,G114<$G$160),\"Puzzle\",IF(AND(I114<$I$160,G114>$G$160),\"Plow Horse\",\"Dog\"))),\"\")","v":"Puzzle"},{"$f":"IFERROR(IF(J114=\"\",D113,E114*J114),D113)","v":0},{"$f":"IFERROR(IF(K114=\"\",E113,K114*$F$3),E113)","v":0},{"$f":"IFERROR(D114*H114,F113)","v":0},{"$f":"IFERROR(IF(E114=\"\",G113,E114/$E$160),G113)","v":0},{"$f":"IFERROR(IF(L114=\"\",H113,L114/J114),H113)","v":""},{"$f":"IFERROR(J114-L114,\"\")","v":""},{"$f":"J113","v":""},{"$f":"K113","v":0},{"$f":"L113","v":""}]
[]
["Baseline",{"$f":"'Cat 1 Setup (example to overide'!A45","v":0},{"$f":"IFERROR(IF(AND(I116>$I$159,G116>$G$159),\"Star\",IF(AND(I116>$I$159,G116<$G$159),\"Puzzle\",IF(AND(I116<$I$159,G116>$G$159),\"Plow Horse\",\"Dog\"))),\"\")","v":"Puzzle"},{"$f":"IFERROR(VLOOKUP(B116,'Cat 1 Setup (example to overide'!$A:$F,4,FALSE),\"\")","v":0},{"$f":"IFERROR(VLOOKUP(B116,'Cat 1 Setup (example to overide'!$A:$F,3,FALSE),\"\")","v":0},{"$f":"IFERROR(VLOOKUP(B116,'Cat 1 Setup (example to overide'!$A:$F,6,FALSE),\"\")","v":0},{"$f":"IFERROR(E116/$E$159,\"\")","v":0},{"$f":"IFERROR(F116/D116,\"\")","v":""},{"$f":"IFERROR(J116-L116,\"\")","v":""},{"$f":"IFERROR(D116/E116,\"\")","v":""},{"$f":"IFERROR(E116/$F$3,\"\")","v":0},{"$f":"IFERROR(J116*H116,\"\")","v":""}]
["Proposed",null,{"$f":"IFERROR(IF(AND(I117>$I$160,G117>$G$160),\"Star\",IF(AND(I117>$I$160,G117<$G$160),\"Puzzle\",IF(AND(I117<$I$160,G117>$G$160),\"Plow Horse\",\"Dog\"))),\"\")","v":"Puzzle"},{"$f":"IFERROR(IF(J117=\"\",D116,E117*J117),D116)","v":0},{"$f":"IFERROR(IF(K117=\"\",E116,K117*$F$3),E116)","v":0},{"$f":"IFERROR(D117*H117,F116)","v":0},{"$f":"IFERROR(IF(E117=\"\",G116,E117/$E$160),G116)","v":0},{"$f":"IFERROR(IF(L117=\"\",H116,L117/J117),H116)","v":""},{"$f":"IFERROR(J117-L117,\"\")","v":""},{"$f":"J116","v":""},{"$f":"K116","v":0},{"$f":"L116","v":""}]
[]
["Baseline",{"$f":"'Cat 1 Setup (example to overide'!A46","v":0},{"$f":"IFERROR(IF(AND(I119>$I$159,G119>$G$159),\"Star\",IF(AND(I119>$I$159,G119<$G$159),\"Puzzle\",IF(AND(I119<$I$159,G119>$G$159),\"Plow Horse\",\"Dog\"))),\"\")","v":"Puzzle"},{"$f":"IFERROR(VLOOKUP(B119,'Cat 1 Setup (example to overide'!$A:$F,4,FALSE),\"\")","v":0},{"$f":"IFERROR(VLOOKUP(B119,'Cat 1 Setup (example to overide'!$A:$F,3,FALSE),\"\")","v":0},{"$f":"IFERROR(VLOOKUP(B119,'Cat 1 Setup (example to overide'!$A:$F,6,FALSE),\"\")","v":0},{"$f":"IFERROR(E119/$E$159,\"\")","v":0},{"$f":"IFERROR(F119/D119,\"\")","v":""},{"$f":"IFERROR(J119-L119,\"\")","v":""},{"$f":"IFERROR(D119/E119,\"\")","v":""},{"$f":"IFERROR(E119/$F$3,\"\")","v":0},{"$f":"IFERROR(J119*H119,\"\")","v":""}]
["Proposed",null,{"$f":"IFERROR(IF(AND(I120>$I$160,G120>$G$160),\"Star\",IF(AND(I120>$I$160,G120<$G$160),\"Puzzle\",IF(AND(I120<$I$160,G120>$G$160),\"Plow Horse\",\"Dog\"))),\"\")","v":"Puzzle"},{"$f":"IFERROR(IF(J120=\"\",D119,E120*J120),D119)","v":0},{"$f":"IFERROR(IF(K120=\"\",E119,K120*$F$3),E119)","v":0},{"$f":"IFERROR(D120*H120,F119)","v":0},{"$f":"IFERROR(IF(E120=\"\",G119,E120/$E$160),G119)","v":0},{"$f":"IFERROR(IF(L120=\"\",H119,L120/J120),H119)","v":""},{"$f":"IFERROR(J120-L120,\"\")","v":""},{"$f":"J119","v":""},{"$f":"K119","v":0},{"$f":"L119","v":""}]
[]
["Baseline",{"$f":"'Cat 1 Setup (example to overide'!A47","v":0},{"$f":"IFERROR(IF(AND(I122>$I$159,G122>$G$159),\"Star\",IF(AND(I122>$I$159,G122<$G$159),\"Puzzle\",IF(AND(I122<$I$159,G122>$G$159),\"Plow Horse\",\"Dog\"))),\"\")","v":"Puzzle"},{"$f":"IFERROR(VLOOKUP(B122,'Cat 1 Setup (example to overide'!$A:$F,4,FALSE),\"\")","v":0},{"$f":"IFERROR(VLOOKUP(B122,'Cat 1 Setup (example to overide'!$A:$F,3,FALSE),\"\")","v":0},{"$f":"IFERROR(VLOOKUP(B122,'Cat 1 Setup (example to overide'!$A:$F,6,FALSE),\"\")","v":0},{"$f":"IFERROR(E122/$E$159,\"\")","v":0},{"$f":"IFERROR(F122/D122,\"\")","v":""},{"$f":"IFERROR(J122-L122,\"\")","v":""},{"$f":"IFERROR(D122/E122,\"\")","v":""},{"$f":"IFERROR(E122/$F$3,\"\")","v":0},{"$f":"IFERROR(J122*H122,\"\")","v":""}]
["Proposed",null,{"$f":"IFERROR(IF(AND(I123>$I$160,G123>$G$160),\"Star\",IF(AND(I123>$I$160,G123<$G$160),\"Puzzle\",IF(AND(I123<$I$160,G123>$G$160),\"Plow Horse\",\"Dog\"))),\"\")","v":"Puzzle"},{"$f":"IFERROR(IF(J123=\"\",D122,E123*J123),D122)","v":0},{"$f":"IFERROR(IF(K123=\"\",E122,K123*$F$3),E122)","v":0},{"$f":"IFERROR(D123*H123,F122)","v":0},{"$f":"IFERROR(IF(E123=\"\",G122,E123/$E$160),G122)","v":0},{"$f":"IFERROR(IF(L123=\"\",H122,L123/J123),H122)","v":""},"",{"$f":"J122","v":""},{"$f":"K122","v":0},{"$f":"L122","v":""}]
[]
["Baseline",{"$f":"'Cat 1 Setup (example to overide'!A48","v":0},{"$f":"IFERROR(IF(AND(I125>$I$159,G125>$G$159),\"Star\",IF(AND(I125>$I$159,G125<$G$159),\"Puzzle\",IF(AND(I125<$I$159,G125>$G$159),\"Plow Horse\",\"Dog\"))),\"\")","v":"Puzzle"},{"$f":"IFERROR(VLOOKUP(B125,'Cat 1 Setup (example to overide'!$A:$F,4,FALSE),\"\")","v":0},{"$f":"IFERROR(VLOOKUP(B125,'Cat 1 Setup (example to overide'!$A:$F,3,FALSE),\"\")","v":0},{"$f":"IFERROR(VLOOKUP(B125,'Cat 1 Setup (example to overide'!$A:$F,6,FALSE),\"\")","v":0},{"$f":"IFERROR(E125/$E$159,\"\")","v":0},{"$f":"IFERROR(F125/D125,\"\")","v":""},{"$f":"IFERROR(J125-L125,\"\")","v":""},{"$f":"IFERROR(D125/E125,\"\")","v":""},{"$f":"IFERROR(E125/$F$3,\"\")","v":0},{"$f":"IFERROR(J125*H125,\"\")","v":""}]
["Proposed",null,{"$f":"IFERROR(IF(AND(I126>$I$160,G126>$G$160),\"Star\",IF(AND(I126>$I$160,G126<$G$160),\"Puzzle\",IF(AND(I126<$I$160,G126>$G$160),\"Plow Horse\",\"Dog\"))),\"\")","v":"Puzzle"},{"$f":"IFERROR(IF(J126=\"\",D125,E126*J126),D125)","v":0},{"$f":"IFERROR(IF(K126=\"\",E125,K126*$F$3),E125)","v":0},{"$f":"IFERROR(D126*H126,F125)","v":0},{"$f":"IFERROR(IF(E126=\"\",G125,E126/$E$160),G125)","v":0},{"$f":"IFERROR(IF(L126=\"\",H125,L126/J126),H125)","v":""},"",{"$f":"J125","v":""},{"$f":"K125","v":0},{"$f":"L125","v":""}]
[]
["Baseline",{"$f":"'Cat 1 Setup (example to overide'!A49","v":0},{"$f":"IFERROR(IF(AND(I128>$I$159,G128>$G$159),\"Star\",IF(AND(I128>$I$159,G128<$G$159),\"Puzzle\",IF(AND(I128<$I$159,G128>$G$159),\"Plow Horse\",\"Dog\"))),\"\")","v":"Puzzle"},{"$f":"IFERROR(VLOOKUP(B128,'Cat 1 Setup (example to overide'!$A:$F,4,FALSE),\"\")","v":0},{"$f":"IFERROR(VLOOKUP(B128,'Cat 1 Setup (example to overide'!$A:$F,3,FALSE),\"\")","v":0},{"$f":"IFERROR(VLOOKUP(B128,'Cat 1 Setup (example to overide'!$A:$F,6,FALSE),\"\")","v":0},{"$f":"IFERROR(E128/$E$159,\"\")","v":0},{"$f":"IFERROR(F128/D128,\"\")","v":""},{"$f":"IFERROR(J128-L128,\"\")","v":""},{"$f":"IFERROR(D128/E128,\"\")","v":""},{"$f":"IFERROR(E128/$F$3,\"\")","v":0},{"$f":"IFERROR(J128*H128,\"\")","v":""}]
["Proposed",null,{"$f":"IFERROR(IF(AND(I129>$I$160,G129>$G$160),\"Star\",IF(AND(I129>$I$160,G129<$G$160),\"Puzzle\",IF(AND(I129<$I$160,G129>$G$160),\"Plow Horse\",\"Dog\"))),\"\")","v":"Puzzle"},{"$f":"IFERROR(IF(J129=\"\",D128,E129*J129),D128)","v":0},{"$f":"IFERROR(IF(K129=\"\",E128,K129*$F$3),E128)","v":0},{"$f":"IFERROR(D129*H129,F128)","v":0},{"$f":"IFERROR(IF(E129=\"\",G128,E129/$E$160),G128)","v":0},{"$f":"IFERROR(IF(L129=\"\",H128,L129/J129),H128)","v":""},"",{"$f":"J128","v":""},{"$f":"K128","v":0},{"$f":"L128","v":""}]
[]
["Baseline",{"$f":"'Cat 1 Setup (example to overide'!A50","v":0},{"$f":"IFERROR(IF(AND(I131>$I$159,G131>$G$159),\"Star\",IF(AND(I131>$I$159,G131<$G$159),\"Puzzle\",IF(AND(I131<$I$159,G131>$G$159),\"Plow Horse\",\"Dog\"))),\"\")","v":"Puzzle"},{"$f":"IFERROR(VLOOKUP(B131,'Cat 1 Setup (example to overide'!$A:$F,4,FALSE),\"\")","v":0},{"$f":"IFERROR(VLOOKUP(B131,'Cat 1 Setup (example to overide'!$A:$F,3,FALSE),\"\")","v":0},{"$f":"IFERROR(VLOOKUP(B131,'Cat 1 Setup (example to overide'!$A:$F,6,FALSE),\"\")","v":0},{"$f":"IFERROR(E131/$E$159,\"\")","v":0},{"$f":"IFERROR(F131/D131,\"\")","v":""},{"$f":"IFERROR(J131-L131,\"\")","v":""},{"$f":"IFERROR(D131/E131,\"\")","v":""},{"$f":"IFERROR(E131/$F$3,\"\")","v":0},{"$f":"IFERROR(J131*H131,\"\")","v":""}]
["Proposed",null,{"$f":"IFERROR(IF(AND(I132>$I$160,G132>$G$160),\"Star\",IF(AND(I132>$I$160,G132<$G$160),\"Puzzle\",IF(AND(I132<$I$160,G132>$G$160),\"Plow Horse\",\"Dog\"))),\"\")","v":"Puzzle"},{"$f":"IFERROR(IF(J132=\"\",D131,E132*J132),D131)","v":0},{"$f":"IFERROR(IF(K132=\"\",E131,K132*$F$3),E131)","v":0},{"$f":"IFERROR(D132*H132,F131)","v":0},{"$f":"IFERROR(IF(E132=\"\",G131,E132/$E$160),G131)","v":0},{"$f":"IFERROR(IF(L132=\"\",H131,L132/J132),H131)","v":""},"",{"$f":"J131","v":""},{"$f":"K131","v":0},{"$f":"L131","v":""}]
[]
["Baseline",{"$f":"'Cat 1 Setup (example to overide'!A51","v":0},{"$f":"IFERROR(IF(AND(I134>$I$159,G134>$G$159),\"Star\",IF(AND(I134>$I$159,G134<$G$159),\"Puzzle\",IF(AND(I134<$I$159,G134>$G$159),\"Plow Horse\",\"Dog\"))),\"\")","v":"Puzzle"},{"$f":"IFERROR(VLOOKUP(B134,'Cat 1 Setup (example to overide'!$A:$F,4,FALSE),\"\")","v":0},{"$f":"IFERROR(VLOOKUP(B134,'Cat 1 Setup (example to overide'!$A:$F,3,FALSE),\"\")","v":0},{"$f":"IFERROR(VLOOKUP(B134,'Cat 1 Setup (example to overide'!$A:$F,6,FALSE),\"\")","v":0},{"$f":"IFERROR(E134/$E$159,\"\")","v":0},{"$f":"IFERROR(F134/D134,\"\")","v":""},{"$f":"IFERROR(J134-L134,\"\")","v":""},{"$f":"IFERROR(D134/E134,\"\")","v":""},{"$f":"IFERROR(E134/$F$3,\"\")","v":0},{"$f":"IFERROR(J134*H134,\"\")","v":""}]
["Proposed",null,{"$f":"IFERROR(IF(AND(I135>$I$160,G135>$G$160),\"Star\",IF(AND(I135>$I$160,G135<$G$160),\"Puzzle\",IF(AND(I135<$I$160,G135>$G$160),\"Plow Horse\",\"Dog\"))),\"\")","v":"Puzzle"},{"$f":"IFERROR(IF(J135=\"\",D134,E135*J135),D134)","v":0},{"$f":"IFERROR(IF(K135=\"\",E134,K135*$F$3),E134)","v":0},{"$f":"IFERROR(D135*H135,F134)","v":0},{"$f":"IFERROR(IF(E135=\"\",G134,E135/$E$160),G134)","v":0},{"$f":"IFERROR(IF(L135=\"\",H134,L135/J135),H134)","v":""},"",{"$f":"J134","v":""},{"$f":"K134","v":0},{"$f":"L134","v":""}]
[]
["Baseline",{"$f":"'Cat 1 Setup (example to overide'!A52","v":0},{"$f":"IFERROR(IF(AND(I137>$I$159,G137>$G$159),\"Star\",IF(AND(I137>$I$159,G137<$G$159),\"Puzzle\",IF(AND(I137<$I$159,G137>$G$159),\"Plow Horse\",\"Dog\"))),\"\")","v":"Puzzle"},{"$f":"IFERROR(VLOOKUP(B137,'Cat 1 Setup (example to overide'!$A:$F,4,FALSE),\"\")","v":0},{"$f":"IFERROR(VLOOKUP(B137,'Cat 1 Setup (example to overide'!$A:$F,3,FALSE),\"\")","v":0},{"$f":"IFERROR(VLOOKUP(B137,'Cat 1 Setup (example to overide'!$A:$F,6,FALSE),\"\")","v":0},{"$f":"IFERROR(E137/$E$159,\"\")","v":0},{"$f":"IFERROR(F137/D137,\"\")","v":""},{"$f":"IFERROR(J137-L137,\"\")","v":""},{"$f":"IFERROR(D137/E137,\"\")","v":""},{"$f":"IFERROR(E137/$F$3,\"\")","v":0},{"$f":"IFERROR(J137*H137,\"\")","v":""}]
["Proposed",null,{"$f":"IFERROR(IF(AND(I138>$I$160,G138>$G$160),\"Star\",IF(AND(I138>$I$160,G138<$G$160),\"Puzzle\",IF(AND(I138<$I$160,G138>$G$160),\"Plow Horse\",\"Dog\"))),\"\")","v":"Puzzle"},{"$f":"IFERROR(IF(J138=\"\",D137,E138*J138),D137)","v":0},{"$f":"IFERROR(IF(K138=\"\",E137,K138*$F$3),E137)","v":0},{"$f":"IFERROR(D138*H138,F137)","v":0},{"$f":"IFERROR(IF(E138=\"\",G137,E138/$E$160),G137)","v":0},{"$f":"IFERROR(IF(L138=\"\",H137,L138/J138),H137)","v":""},"",{"$f":"J137","v":""},{"$f":"K137","v":0},{"$f":"L137","v":""}]
[]
["Baseline",{"$f":"'Cat 1 Setup (example to overide'!A53","v":0},{"$f":"IFERROR(IF(AND(I140>$I$159,G140>$G$159),\"Star\",IF(AND(I140>$I$159,G140<$G$159),\"Puzzle\",IF(AND(I140<$I$159,G140>$G$159),\"Plow Horse\",\"Dog\"))),\"\")","v":"Puzzle"},{"$f":"IFERROR(VLOOKUP(B140,'Cat 1 Setup (example to overide'!$A:$F,4,FALSE),\"\")","v":0},{"$f":"IFERROR(VLOOKUP(B140,'Cat 1 Setup (example to overide'!$A:$F,3,FALSE),\"\")","v":0},{"$f":"IFERROR(VLOOKUP(B140,'Cat 1 Setup (example to overide'!$A:$F,6,FALSE),\"\")","v":0},{"$f":"IFERROR(E140/$E$159,\"\")","v":0},{"$f":"IFERROR(F140/D140,\"\")","v":""},{"$f":"IFERROR(J140-L140,\"\")","v":""},{"$f":"IFERROR(D140/E140,\"\")","v":""},{"$f":"IFERROR(E140/$F$3,\"\")","v":0},{"$f":"IFERROR(J140*H140,\"\")","v":""}]
["Proposed",null,{"$f":"IFERROR(IF(AND(I141>$I$160,G141>$G$160),\"Star\",IF(AND(I141>$I$160,G141<$G$160),\"Puzzle\",IF(AND(I141<$I$160,G141>$G$160),\"Plow Horse\",\"Dog\"))),\"\")","v":"Puzzle"},{"$f":"IFERROR(IF(J141=\"\",D140,E141*J141),D140)","v":0},{"$f":"IFERROR(IF(K141=\"\",E140,K141*$F$3),E140)","v":0},{"$f":"IFERROR(D141*H141,F140)","v":0},{"$f":"IFERROR(IF(E141=\"\",G140,E141/$E$160),G140)","v":0},{"$f":"IFERROR(IF(L141=\"\",H140,L141/J141),H140)","v":""},"",{"$f":"J140","v":""},{"$f":"K140","v":0},{"$f":"L140","v":""}]
[]
["Baseline",{"$f":"'Cat 1 Setup (example to overide'!A54","v":0},{"$f":"IFERROR(IF(AND(I143>$I$159,G143>$G$159),\"Star\",IF(AND(I143>$I$159,G143<$G$159),\"Puzzle\",IF(AND(I143<$I$159,G143>$G$159),\"Plow Horse\",\"Dog\"))),\"\")","v":"Puzzle"},{"$f":"IFERROR(VLOOKUP(B143,'Cat 1 Setup (example to overide'!$A:$F,4,FALSE),\"\")","v":0},{"$f":"IFERROR(VLOOKUP(B143,'Cat 1 Setup (example to overide'!$A:$F,3,FALSE),\"\")","v":0},{"$f":"IFERROR(VLOOKUP(B143,'Cat 1 Setup (example to overide'!$A:$F,6,FALSE),\"\")","v":0},{"$f":"IFERROR(E143/$E$159,\"\")","v":0},{"$f":"IFERROR(F143/D143,\"\")","v":""},{"$f":"IFERROR(J143-L143,\"\")","v":""},{"$f":"IFERROR(D143/E143,\"\")","v":""},{"$f":"IFERROR(E143/$F$3,\"\")","v":0},{"$f":"IFERROR(J143*H143,\"\")","v":""}]
["Proposed",null,{"$f":"IFERROR(IF(AND(I144>$I$160,G144>$G$160),\"Star\",IF(AND(I144>$I$160,G144<$G$160),\"Puzzle\",IF(AND(I144<$I$160,G144>$G$160),\"Plow Horse\",\"Dog\"))),\"\")","v":"Puzzle"},{"$f":"IFERROR(IF(J144=\"\",D143,E144*J144),D143)","v":0},{"$f":"IFERROR(IF(K144=\"\",E143,K144*$F$3),E143)","v":0},{"$f":"IFERROR(D144*H144,F143)","v":0},{"$f":"IFERROR(IF(E144=\"\",G143,E144/$E$160),G143)","v":0},{"$f":"IFERROR(IF(L144=\"\",H143,L144/J144),H143)","v":""},"",{"$f":"J143","v":""},{"$f":"K143","v":0},{"$f":"L143","v":""}]
[]
["Baseline",{"$f":"'Cat 1 Setup (example to overide'!A55","v":0},{"$f":"IFERROR(IF(AND(I146>$I$159,G146>$G$159),\"Star\",IF(AND(I146>$I$159,G146<$G$159),\"Puzzle\",IF(AND(I146<$I$159,G146>$G$159),\"Plow Horse\",\"Dog\"))),\"\")","v":"Puzzle"},{"$f":"IFERROR(VLOOKUP(B146,'Cat 1 Setup (example to overide'!$A:$F,4,FALSE),\"\")","v":0},{"$f":"IFERROR(VLOOKUP(B146,'Cat 1 Setup (example to overide'!$A:$F,3,FALSE),\"\")","v":0},{"$f":"IFERROR(VLOOKUP(B146,'Cat 1 Setup (example to overide'!$A:$F,6,FALSE),\"\")","v":0},{"$f":"IFERROR(E146/$E$159,\"\")","v":0},{"$f":"IFERROR(F146/D146,\"\")","v":""},{"$f":"IFERROR(J146-L146,\"\")","v":""},{"$f":"IFERROR(D146/E146,\"\")","v":""},{"$f":"IFERROR(E146/$F$3,\"\")","v":0},{"$f":"IFERROR(J146*H146,\"\")","v":""}]
["Proposed",null,{"$f":"IFERROR(IF(AND(I147>$I$160,G147>$G$160),\"Star\",IF(AND(I147>$I$160,G147<$G$160),\"Puzzle\",IF(AND(I147<$I$160,G147>$G$160),\"Plow Horse\",\"Dog\"))),\"\")","v":"Puzzle"},{"$f":"IFERROR(IF(J147=\"\",D146,E147*J147),D146)","v":0},{"$f":"IFERROR(IF(K147=\"\",E146,K147*$F$3),E146)","v":0},{"$f":"IFERROR(D147*H147,F146)","v":0},{"$f":"IFERROR(IF(E147=\"\",G146,E147/$E$160),G146)","v":0},{"$f":"IFERROR(IF(L147=\"\",H146,L147/J147),H146)","v":""},"",{"$f":"J146","v":""},{"$f":"K146","v":0},{"$f":"L146","v":""}]
[]
["Baseline",{"$f":"'Cat 1 Setup (example to overide'!A56","v":0},{"$f":"IFERROR(IF(AND(I149>$I$159,G149>$G$159),\"Star\",IF(AND(I149>$I$159,G149<$G$159),\"Puzzle\",IF(AND(I149<$I$159,G149>$G$159),\"Plow Horse\",\"Dog\"))),\"\")","v":"Puzzle"},{"$f":"IFERROR(VLOOKUP(B149,'Cat 1 Setup (example to overide'!$A:$F,4,FALSE),\"\")","v":0},{"$f":"IFERROR(VLOOKUP(B149,'Cat 1 Setup (example to overide'!$A:$F,3,FALSE),\"\")","v":0},{"$f":"IFERROR(VLOOKUP(B149,'Cat 1 Setup (example to overide'!$A:$F,6,FALSE),\"\")","v":0},{"$f":"IFERROR(E149/$E$159,\"\")","v":0},{"$f":"IFERROR(F149/D149,\"\")","v":""},{"$f":"IFERROR(J149-L149,\"\")","v":""},{"$f":"IFERROR(D149/E149,\"\")","v":""},{"$f":"IFERROR(E149/$F$3,\"\")","v":0},{"$f":"IFERROR(J149*H149,\"\")","v":""}]
["Proposed",null,{"$f":"IFERROR(IF(AND(I150>$I$160,G150>$G$160),\"Star\",IF(AND(I150>$I$160,G150<$G$160),\"Puzzle\",IF(AND(I150<$I$160,G150>$G$160),\"Plow Horse\",\"Dog\"))),\"\")","v":"Puzzle"},{"$f":"IFERROR(IF(J150=\"\",D149,E150*J150),D149)","v":0},{"$f":"IFERROR(IF(K150=\"\",E149,K150*$F$3),E149)","v":0},{"$f":"IFERROR(D150*H150,F149)","v":0},{"$f":"IFERROR(IF(E150=\"\",G149,E150/$E$160),G149)","v":0},{"$f":"IFERROR(IF(L150=\"\",H149,L150/J150),H149)","v":""},"",{"$f":"J149","v":""},{"$f":"K149","v":0},{"$f":"L149","v":""}]
[]
["Baseline",{"$f":"'Cat 1 Setup (example to overide'!A57","v":0},{"$f":"IFERROR(IF(AND(I152>$I$159,G152>$G$159),\"Star\",IF(AND(I152>$I$159,G152<$G$159),\"Puzzle\",IF(AND(I152<$I$159,G152>$G$159),\"Plow Horse\",\"Dog\"))),\"\")","v":"Puzzle"},{"$f":"IFERROR(VLOOKUP(B152,'Cat 1 Setup (example to overide'!$A:$F,4,FALSE),\"\")","v":0},{"$f":"IFERROR(VLOOKUP(B152,'Cat 1 Setup (example to overide'!$A:$F,3,FALSE),\"\")","v":0},{"$f":"IFERROR(VLOOKUP(B152,'Cat 1 Setup (example to overide'!$A:$F,6,FALSE),\"\")","v":0},{"$f":"IFERROR(E152/$E$159,\"\")","v":0},{"$f":"IFERROR(F152/D152,\"\")","v":""},{"$f":"IFERROR(J152-L152,\"\")","v":""},{"$f":"IFERROR(D152/E152,\"\")","v":""},{"$f":"IFERROR(E152/$F$3,\"\")","v":0},{"$f":"IFERROR(J152*H152,\"\")","v":""}]
["Proposed",null,{"$f":"IFERROR(IF(AND(I153>$I$160,G153>$G$160),\"Star\",IF(AND(I153>$I$160,G153<$G$160),\"Puzzle\",IF(AND(I153<$I$160,G153>$G$160),\"Plow Horse\",\"Dog\"))),\"\")","v":"Puzzle"},{"$f":"IFERROR(IF(J153=\"\",D152,E153*J153),D152)","v":0},{"$f":"IFERROR(IF(K153=\"\",E152,K153*$F$3),E152)","v":0},{"$f":"IFERROR(D153*H153,F152)","v":0},{"$f":"IFERROR(IF(E153=\"\",G152,E153/$E$160),G152)","v":0},{"$f":"IFERROR(IF(L153=\"\",H152,L153/J153),H152)","v":""},"",{"$f":"J152","v":""},{"$f":"K152","v":0},{"$f":"L152","v":""}]
[]
["Baseline",{"$f":"'Cat 1 Setup (example to overide'!A58","v":0},{"$f":"IFERROR(IF(AND(I155>$I$159,G155>$G$159),\"Star\",IF(AND(I155>$I$159,G155<$G$159),\"Puzzle\",IF(AND(I155<$I$159,G155>$G$159),\"Plow Horse\",\"Dog\"))),\"\")","v":"Puzzle"},{"$f":"IFERROR(VLOOKUP(B155,'Cat 1 Setup (example to overide'!$A:$F,4,FALSE),\"\")","v":0},{"$f":"IFERROR(VLOOKUP(B155,'Cat 1 Setup (example to overide'!$A:$F,3,FALSE),\"\")","v":0},{"$f":"IFERROR(VLOOKUP(B155,'Cat 1 Setup (example to overide'!$A:$F,6,FALSE),\"\")","v":0},{"$f":"IFERROR(E155/$E$159,\"\")","v":0},{"$f":"IFERROR(F155/D155,\"\")","v":""},{"$f":"IFERROR(J155-L155,\"\")","v":""},{"$f":"IFERROR(D155/E155,\"\")","v":""},{"$f":"IFERROR(E155/$F$3,\"\")","v":0},{"$f":"IFERROR(J155*H155,\"\")","v":""}]
["Proposed",null,{"$f":"IFERROR(IF(AND(I156>$I$160,G156>$G$160),\"Star\",IF(AND(I156>$I$160,G156<$G$160),\"Puzzle\",IF(AND(I156<$I$160,G156>$G$160),\"Plow Horse\",\"Dog\"))),\"\")","v":"Puzzle"},{"$f":"IFERROR(IF(J156=\"\",D155,E156*J156),D155)","v":0},{"$f":"IFERROR(IF(K156=\"\",E155,K156*$F$3),E155)","v":0},{"$f":"IFERROR(D156*H156,F155)","v":0},{"$f":"IFERROR(IF(E156=\"\",G155,E156/$E$160),G155)","v":0},{"$f":"IFERROR(IF(L156=\"\",H155,L156/J156),H155)","v":""},"",{"$f":"J155","v":""},{"$f":"K155","v":0},{"$f":"L155","v":""}]
[]
[null,null,null,null,null,null,null,null,null,null,"(Items/Cover)"]
["Baseline","Total",null,{"$f":"IFERROR(SUMIF($A$8:$A$156,\"Baseline\",D$8:D$156),\"\")","v":269884.5},{"$f":"IFERROR(SUMIF($A$8:$A$156,\"Baseline\",E$8:E$156),\"\")","v":10653},{"$f":"IFERROR(SUMIF($A$8:$A$156,\"Baseline\",F$8:F$156),\"\")","v":100389.94},{"$f":"IFERROR((AVERAGEIFS(G$8:G$156,$A$8:$A$156,\"Baseline\",G$8:G$156,\">0\")),\"\")","v":0.05},{"$f":"IFERROR(F159/D159,\"\")","v":0.37197371468165086},{"$f":"IFERROR(AVERAGEIF($A$8:$A$156,\"Baseline\",I$8:I$156),\"\")","v":16.18495362759888},{"$f":"IFERROR(D159/E159,\"\")","v":25.334131230639258},{"$f":"IFERROR(E159/$F$3,\"\")","v":6.3110189573459712},{"$f":"IFERROR(F159/E159,\"\")","v":9.4236309020933078}]
["Proposed",null,null,{"$f":"IFERROR(SUMIF($A$8:$A$156,\"Proposed\",D$8:D$156),\"\")","v":269884.5},{"$f":"IFERROR(SUMIF($A$8:$A$156,\"Proposed\",E$8:E$156),\"\")","v":10653},{"$f":"IFERROR(SUMIF($A$8:$A$156,\"Proposed\",F$8:F$156),\"\")","v":100389.94},{"$f":"IFERROR((AVERAGEIFS(G$8:G$156,$A$8:$A$156,\"Proposed\",G$8:G$156,\">0\")),\"\")","v":0.05},{"$f":"IFERROR(F160/D160,\"\")","v":0.37197371468165086},{"$f":"IFERROR(AVERAGEIF($A$8:$A$156,\"Proposed\",I$8:I$156),\"\")","v":16.18495362759888},{"$f":"IFERROR(D160/E160,\"\")","v":25.334131230639258},{"$f":"IFERROR(E160/$F$3,\"\")","v":6.3110189573459712},{"$f":"IFERROR(F160/E160,\"\")","v":9.4236309020933078}]
[null,"%/BPs change",null,{"$f":"IFERROR((D160-D159)/D159,\"\")","v":0},{"$f":"IFERROR((E160-E159)/E159,\"\")","v":0},0,{"$f":"(G160-G159)*100","v":0},{"$f":"(H160-H159)*100","v":0},0,0,0,0]
[]
[]
[null,"Assumptions/Exclusions:"]
[]
[]
[]
[]
[]
[]
[null,"Admin Use:"]
[null,"CM (min):",{"$f":"ROUND(MIN(I8:I157),0)-5","v":5},"Demand (max):",null,{"$f":"MIN(G8:G157)-0.05","v":-0.05}]
[null,"CM (max):",{"$f":"ROUND(MAX(I8:I157),0)+5","v":26},"Demand (min):",null,{"$f":"MAX(G8:G157)+0.05","v":0.14368253074251386}]

{"sheet":"Cat 1 CM$ Chart","index":4,"n_rows":46,"n_cols":7,"rows_kept":46,"cut":false,"hidden":false,"merged":[[44,3,44,4],[45,3,45,4]]}
[{"$f":"CONCATENATE('Cat 1 CM$'!C1,\" \",'Cat 1 CM$'!C5,\" \",'Cat 1 CM$'!C4,\" - \",'Cat 1 CM$'!F5)","v":"Blue Café Dining Room Dinner - Entrée"}]
["Menu Enginnering Graph by Contribution Margin Dollars"]
[]
[]
[]
[]
[]
[]
[]
[]
[]
[]
[]
[]
[]
[]
[]
[]
[]
[]
[]
[]
[]
[]
[]
[]
[]
[]
[]
[]
[]
[]
[]
[]
[]
[]
[]
[]
[]
[]
[]
[]
[]
[null,null,null,null,null,"Low","High"]
[null,null,"X-AXIS -->","Menu Mix Parameters:",null,{"$f":"IFERROR(IF('Cat 1 CM$'!D8=\"\",\"\",MIN('Cat 1 CM$'!G8:G157)*0.9),\"\")","v":0},{"$f":"IFERROR(IF('Cat 1 CM$'!D8=\"\",\"\",MAX('Cat 1 CM$'!G8:G157)*1.1),\"\")","v":0.10305078381676523}]
[null,null,"Y-AXIS -->","Contribution Margin:",null,{"$f":"IFERROR(IF('Cat 1 CM$'!D8=\"\",\"\",MIN('Cat 1 CM$'!$I$8:$I$157)*0.9),\"\")","v":8.6940000000000008},{"$f":"IFERROR(IF('Cat 1 CM$'!D8=\"\",\"\",MAX('Cat 1 CM$'!$I$8:$I$157)*1.1),\"\")","v":23.463000000000001}]

{"sheet":"Cat 1 CM%","index":5,"n_rows":173,"n_cols":12,"rows_kept":173,"cut":false,"hidden":false,"merged":[[171,3,171,4],[172,3,172,4],[58,1,59,1],[25,1,26,1],[28,1,29,1],[31,1,32,1],[34,1,35,1],[37,1,38,1],[40,1,41,1],[112,1,113,1],[79,1,80,1],[82,1,83,1],[85,1,86,1],[88,1,89,1],[91,1,92,1],[94,1,95,1],[22,1,23,1],[7,1,8,1],[10,1,11,1],[13,1,14,1],[16,1,17,1],[19,1,20,1],[106,1,107,1],[109,1,110,1],[97,1,98,1],[100,1,101,1],[103,1,104,1],[76,1,77,1],[43,1,44,1],[46,1,47,1],[49,1,50,1],[52,1,53,1],[55,1,56,1],[61,1,62,1],[64,1,65,1],[67,1,68,1],[70,1,71,1],[73,1,74,1],[115,1,116,1],[118,1,119,1],[158,1,159,2],[160,1,160,2],[121,1,122,1],[124,1,125,1],[127,1,128,1],[130,1,131,1],[133,1,134,1],[136,1,137,1],[139,1,140,1],[142,1,143,1],[145,1,146,1],[148,1,149,1],[151,1,152,1],[154,1,155,1]]}
[null,"Restaurant Name",{"$f":"'Cat 1 Setup (example to overide'!L1","v":"Blue Café"}]
[null,"Start Date:",{"$f":"'Cat 1 Setup (example to overide'!L5","v":"2023-11-01"},null,"Check Count:",{"$f":"'Cat 1 Setup (example to overide'!N1","v":600}]
[null,"End Date",{"$f":"'Cat 1 Setup (example to overide'!N5","v":"2023-01-31"},null,"Cover Count:",{"$f":"'Cat 1 Setup (example to overide'!N2","v":1688}]
[null,"Meal Period:",{"$f":"'Cat 1 Setup (example to overide'!L2","v":"Dinner"},null,"Average Check:",{"$f":"'Cat 1 Setup (example to overide'!N3","v":48.09}]
[null,"Revenue Center:",{"$f":"'Cat 1 Setup (example to overide'!L3","v":"Dining Room"},null,"Menu Category",{"$f":"'Cat 1 Setup (example to overide'!L4","v":"Entrée"}]
[]
[null,"Item Name","Quadrant","Item Sales","Qty Sold","Food Cost","Menu Mix %","Item Cost %","Contribution Margin %","Item Price","Item/Cover%","Item Cost"]
["Baseline",{"$f":"'Cat 1 Setup (example to overide'!A9","v":"SALMON"},{"$f":"IFERROR(IF(AND(I8>$I$159,G8>$G$159),\"Star\",IF(AND(I8>$I$159,G8<$G$159),\"Puzzle\",IF(AND(I8<$I$159,G8>$G$159),\"Plow Horse\",\"Dog\"))),\"\")","v":"Star"},{"$f":"IFERROR(VLOOKUP(B8,'Cat 1 Setup (example to overide'!$A:$F,4,FALSE),\"\")","v":25948},{"$f":"IFERROR(VLOOKUP(B8,'Cat 1 Setup (example to overide'!$A:$F,3,FALSE),\"\")","v":998},{"$f":"IFERROR(VLOOKUP(B8,'Cat 1 Setup (example to overide'!$A:$F,6,FALSE),\"\")","v":5349.28},{"$f":"IFERROR(E8/$E$159,\"\")","v":9.3682530742513842E-2},{"$f":"IFERROR(F8/D8,\"\")","v":0.20615384615384613},{"$f":"IFERROR((J8-L8)/J8,\"\")","v":0.79384615384615387},{"$f":"IFERROR(D8/E8,\"\")","v":26},{"$f":"IFERROR(E8/$F$3,\"\")","v":0.59123222748815163},{"$f":"IFERROR(J8*H8,\"\")","v":5.3599999999999994}]
["Proposed",null,{"$f":"IFERROR(IF(AND(I9>$I$160,G9>$G$160),\"Star\",IF(AND(I9>$I$160,G9<$G$160),\"Puzzle\",IF(AND(I9<$I$160,G9>$G$160),\"Plow Horse\",\"Dog\"))),\"\")","v":"Star"},{"$f":"IFERROR(IF(J9=\"\",D8,E9*J9),D8)","v":25948},{"$f":"IFERROR(IF(K9=\"\",E8,K9*$F$3),E8)","v":998},{"$f":"IFERROR(D9*H9,F8)","v":5349.28},{"$f":"IFERROR(IF(E9=\"\",G8,E9/$E$160),G8)","v":9.3682530742513842E-2},{"$f":"IFERROR(IF(L9=\"\",H8,L9/J9),H8)","v":0.20615384615384613},{"$f":"IFERROR((J9-L9)/J9,\"\")","v":0.79384615384615387},{"$f":"J8","v":26},{"$f":"K8","v":0.59123222748815163},{"$f":"L8","v":5.3599999999999994}]
[]
["Baseline",{"$f":"'Cat 1 Setup (example to overide'!A10","v":"TROUT AMADINE"},{"$f":"IFERROR(IF(AND(I11>$I$159,G11>$G$159),\"Star\",IF(AND(I11>$I$159,G11<$G$159),\"Puzzle\",IF(AND(I11<$I$159,G11>$G$159),\"Plow Horse\",\"Dog\"))),\"\")","v":"Star"},{"$f":"IFERROR(VLOOKUP(B11,'Cat 1 Setup (example to overide'!$A:$F,4,FALSE),\"\")","v":22872},{"$f":"IFERROR(VLOOKUP(B11,'Cat 1 Setup (example to overide'!$A:$F,3,FALSE),\"\")","v":953},{"$f":"IFERROR(VLOOKUP(B11,'Cat 1 Setup (example to overide'!$A:$F,6,FALSE),\"\")","v":7195.15},{"$f":"IFERROR(E11/$E$159,\"\")","v":8.945836853468507E-2},{"$f":"IFERROR(F11/D11,\"\")","v":0.31458333333333333},{"$f":"IFERROR((J11-L11)/J11,\"\")","v":0.68541666666666667},{"$f":"IFERROR(D11/E11,\"\")","v":24},{"$f":"IFERROR(E11/$F$3,\"\")","v":0.56457345971563977},{"$f":"IFERROR(J11*H11,\"\")","v":7.55}]
["Proposed",null,{"$f":"IFERROR(IF(AND(I12>$I$160,G12>$G$160),\"Star\",IF(AND(I12>$I$160,G12<$G$160),\"Puzzle\",IF(AND(I12<$I$160,G12>$G$160),\"Plow Horse\",\"Dog\"))),\"\")","v":"Star"},{"$f":"IFERROR(IF(J12=\"\",D11,E12*J12),D11)","v":22871.999999999996},{"$f":"IFERROR(IF(K12=\"\",E11,K12*$F$3),E11)","v":952.99999999999989},{"$f":"IFERROR(D12*H12,F11)","v":7195.1499999999987},{"$f":"IFERROR(IF(E12=\"\",G11,E12/$E$160),G11)","v":8.9458368534685057E-2},{"$f":"IFERROR(IF(L12=\"\",H11,L12/J12),H11)","v":0.31458333333333333},{"$f":"IFERROR((J12-L12)/J12,\"\")","v":0.68541666666666667},{"$f":"J11","v":24},{"$f":"K11","v":0.56457345971563977},{"$f":"L11","v":7.55}]
[]
["Baseline",{"$f":"'Cat 1 Setup (example to overide'!A11","v":"MOULES FRITES"},{"$f":"IFERROR(IF(AND(I14>$I$159,G14>$G$159),\"Star\",IF(AND(I14>$I$159,G14<$G$159),\"Puzzle\",IF(AND(I14<$I$159,G14>$G$159),\"Plow Horse\",\"Dog\"))),\"\")","v":"Star"},{"$f":"IFERROR(VLOOKUP(B14,'Cat 1 Setup (example to overide'!$A:$F,4,FALSE),\"\")","v":16222.5},{"$f":"IFERROR(VLOOKUP(B14,'Cat 1 Setup (example to overide'!$A:$F,3,FALSE),\"\")","v":927},{"$f":"IFERROR(VLOOKUP(B14,'Cat 1 Setup (example to overide'!$A:$F,6,FALSE),\"\")","v":5061.42},{"$f":"IFERROR(E14/$E$159,\"\")","v":8.7017741481272878E-2},{"$f":"IFERROR(F14/D14,\"\")","v":0.312},{"$f":"IFERROR((J14-L14)/J14,\"\")","v":0.68799999999999994},{"$f":"IFERROR(D14/E14,\"\")","v":17.5},{"$f":"IFERROR(E14/$F$3,\"\")","v":0.54917061611374407},{"$f":"IFERROR(J14*H14,\"\")","v":5.46}]
["Proposed",null,{"$f":"IFERROR(IF(AND(I15>$I$160,G15>$G$160),\"Star\",IF(AND(I15>$I$160,G15<$G$160),\"Puzzle\",IF(AND(I15<$I$160,G15>$G$160),\"Plow Horse\",\"Dog\"))),\"\")","v":"Star"},{"$f":"IFERROR(IF(J15=\"\",D14,E15*J15),D14)","v":16222.5},{"$f":"IFERROR(IF(K15=\"\",E14,K15*$F$3),E14)","v":927},{"$f":"IFERROR(D15*H15,F14)","v":5061.42},{"$f":"IFERROR(IF(E15=\"\",G14,E15/$E$160),G14)","v":8.7017741481272878E-2},{"$f":"IFERROR(IF(L15=\"\",H14,L15/J15),H14)","v":0.312},{"$f":"IFERROR((J15-L15)/J15,\"\")","v":0.68799999999999994},{"$f":"J14","v":17.5},{"$f":"K14","v":0.54917061611374407},{"$f":"L14","v":5.46}]
[]
["Baseline",{"$f":"'Cat 1 Setup (example to overide'!A12","v":"WILD HALIBUT"},{"$f":"IFERROR(IF(AND(I17>$I$159,G17>$G$159),\"Star\",IF(AND(I17>$I$159,G17<$G$159),\"Puzzle\",IF(AND(I17<$I$159,G17>$G$159),\"Plow Horse\",\"Dog\"))),\"\")","v":"Plow Horse"},{"$f":"IFERROR(VLOOKUP(B17,'Cat 1 Setup (example to overide'!$A:$F,4,FALSE),\"\")","v":26651},{"$f":"IFERROR(VLOOKUP(B17,'Cat 1 Setup (example to overide'!$A:$F,3,FALSE),\"\")","v":919},{"$f":"IFERROR(VLOOKUP(B17,'Cat 1 Setup (example to overide'!$A:$F,6,FALSE),\"\")","v":17433.43},{"$f":"IFERROR(E17/$E$159,\"\")","v":8.6266779310992206E-2},{"$f":"IFERROR(F17/D17,\"\")","v":0.65413793103448281},{"$f":"IFERROR((J17-L17)/J17,\"\")","v":0.34586206896551713},{"$f":"IFERROR(D17/E17,\"\")","v":29},{"$f":"IFERROR(E17/$F$3,\"\")","v":0.54443127962085303},{"$f":"IFERROR(J17*H17,\"\")","v":18.970000000000002}]
["Proposed",null,{"$f":"IFERROR(IF(AND(I18>$I$160,G18>$G$160),\"Star\",IF(AND(I18>$I$160,G18<$G$160),\"Puzzle\",IF(AND(I18<$I$160,G18>$G$160),\"Plow Horse\",\"Dog\"))),\"\")","v":"Plow Horse"},{"$f":"IFERROR(IF(J18=\"\",D17,E18*J18),D17)","v":26650.999999999996},{"$f":"IFERROR(IF(K18=\"\",E17,K18*$F$3),E17)","v":918.99999999999989},{"$f":"IFERROR(D18*H18,F17)","v":17433.43},{"$f":"IFERROR(IF(E18=\"\",G17,E18/$E$160),G17)","v":8.6266779310992192E-2},{"$f":"IFERROR(IF(L18=\"\",H17,L18/J18),H17)","v":0.65413793103448281},{"$f":"IFERROR((J18-L18)/J18,\"\")","v":0.34586206896551713},{"$f":"J17","v":29},{"$f":"K17","v":0.54443127962085303},{"$f":"L17","v":18.970000000000002}]
[]
["Baseline",{"$f":"'Cat 1 Setup (example to overide'!A13","v":"BRAISED SHORT RIB"},{"$f":"IFERROR(IF(AND(I20>$I$159,G20>$G$159),\"Star\",IF(AND(I20>$I$159,G20<$G$159),\"Puzzle\",IF(AND(I20<$I$159,G20>$G$159),\"Plow Horse\",\"Dog\"))),\"\")","v":"Plow Horse"},{"$f":"IFERROR(VLOOKUP(B20,'Cat 1 Setup (example to overide'!$A:$F,4,FALSE),\"\")","v":22646},{"$f":"IFERROR(VLOOKUP(B20,'Cat 1 Setup (example to overide'!$A:$F,3,FALSE),\"\")","v":871},{"$f":"IFERROR(VLOOKUP(B20,'Cat 1 Setup (example to overide'!$A:$F,6,FALSE),\"\")","v":9981.66},{"$f":"IFERROR(E20/$E$159,\"\")","v":8.1761006289308172E-2},{"$f":"IFERROR(F20/D20,\"\")","v":0.44076923076923075},{"$f":"IFERROR((J20-L20)/J20,\"\")","v":0.55923076923076931},{"$f":"IFERROR(D20/E20,\"\")","v":26},{"$f":"IFERROR(E20/$F$3,\"\")","v":0.51599526066350709},{"$f":"IFERROR(J20*H20,\"\")","v":11.459999999999999}]
["Proposed",null,{"$f":"IFERROR(IF(AND(I21>$I$160,G21>$G$160),\"Star\",IF(AND(I21>$I$160,G21<$G$160),\"Puzzle\",IF(AND(I21<$I$160,G21>$G$160),\"Plow Horse\",\"Dog\"))),\"\")","v":"Plow Horse"},{"$f":"IFERROR(IF(J21=\"\",D20,E21*J21),D20)","v":22646},{"$f":"IFERROR(IF(K21=\"\",E20,K21*$F$3),E20)","v":871},{"$f":"IFERROR(D21*H21,F20)","v":9981.66},{"$f":"IFERROR(IF(E21=\"\",G20,E21/$E$160),G20)","v":8.1761006289308172E-2},{"$f":"IFERROR(IF(L21=\"\",H20,L21/J21),H20)","v":0.44076923076923075},{"$f":"IFERROR((J21-L21)/J21,\"\")","v":0.55923076923076931},{"$f":"J20","v":26},{"$f":"K20","v":0.51599526066350709},{"$f":"L20","v":11.459999999999999}]
[]
["Baseline",{"$f":"'Cat 1 Setup (example to overide'!A14","v":"LAMB SHANK"},{"$f":"IFERROR(IF(AND(I23>$I$159,G23>$G$159),\"Star\",IF(AND(I23>$I$159,G23<$G$159),\"Puzzle\",IF(AND(I23<$I$159,G23>$G$159),\"Plow Horse\",\"Dog\"))),\"\")","v":"Plow Horse"},{"$f":"IFERROR(VLOOKUP(B23,'Cat 1 Setup (example to overide'!$A:$F,4,FALSE),\"\")","v":23324},{"$f":"IFERROR(VLOOKUP(B23,'Cat 1 Setup (example to overide'!$A:$F,3,FALSE),\"\")","v":833},{"$f":"IFERROR(VLOOKUP(B23,'Cat 1 Setup (example to overide'!$A:$F,6,FALSE),\"\")","v":8729.84},{"$f":"IFERROR(E23/$E$159,\"\")","v":7.8193935980474985E-2},{"$f":"IFERROR(F23/D23,\"\")","v":0.37428571428571428},{"$f":"IFERROR((J23-L23)/J23,\"\")","v":0.62571428571428567},{"$f":"IFERROR(D23/E23,\"\")","v":28},{"$f":"IFERROR(E23/$F$3,\"\")","v":0.49348341232227488},{"$f":"IFERROR(J23*H23,\"\")","v":10.48}]
["Proposed",null,{"$f":"IFERROR(IF(AND(I24>$I$160,G24>$G$160),\"Star\",IF(AND(I24>$I$160,G24<$G$160),\"Puzzle\",IF(AND(I24<$I$160,G24>$G$160),\"Plow Horse\",\"Dog\"))),\"\")","v":"Plow Horse"},{"$f":"IFERROR(IF(J24=\"\",D23,E24*J24),D23)","v":23324},{"$f":"IFERROR(IF(K24=\"\",E23,K24*$F$3),E23)","v":833},{"$f":"IFERROR(D24*H24,F23)","v":8729.84},{"$f":"IFERROR(IF(E24=\"\",G23,E24/$E$160),G23)","v":7.8193935980474985E-2},{"$f":"IFERROR(IF(L24=\"\",H23,L24/J24),H23)","v":0.37428571428571428},{"$f":"IFERROR((J24-L24)/J24,\"\")","v":0.62571428571428567},{"$f":"J23","v":28},{"$f":"K23","v":0.49348341232227488},{"$f":"L23","v":10.48}]
[]
["Baseline",{"$f":"'Cat 1 Setup (example to overide'!A15","v":"ROTISSERIE DUCK"},{"$f":"IFERROR(IF(AND(I26>$I$159,G26>$G$159),\"Star\",IF(AND(I26>$I$159,G26<$G$159),\"Puzzle\",IF(AND(I26<$I$159,G26>$G$159),\"Plow Horse\",\"Dog\"))),\"\")","v":"Plow Horse"},{"$f":"IFERROR(VLOOKUP(B26,'Cat 1 Setup (example to overide'!$A:$F,4,FALSE),\"\")","v":23983},{"$f":"IFERROR(VLOOKUP(B26,'Cat 1 Setup (example to overide'!$A:$F,3,FALSE),\"\")","v":827},{"$f":"IFERROR(VLOOKUP(B26,'Cat 1 Setup (example to overide'!$A:$F,6,FALSE),\"\")","v":8774.4699999999993},{"$f":"IFERROR(E26/$E$159,\"\")","v":7.7630714352764474E-2},{"$f":"IFERROR(F26/D26,\"\")","v":0.36586206896551721},{"$f":"IFERROR((J26-L26)/J26,\"\")","v":0.63413793103448279},{"$f":"IFERROR(D26/E26,\"\")","v":29},{"$f":"IFERROR(E26/$F$3,\"\")","v":0.48992890995260663},{"$f":"IFERROR(J26*H26,\"\")","v":10.61}]
["Proposed",null,{"$f":"IFERROR(IF(AND(I27>$I$160,G27>$G$160),\"Star\",IF(AND(I27>$I$160,G27<$G$160),\"Puzzle\",IF(AND(I27<$I$160,G27>$G$160),\"Plow Horse\",\"Dog\"))),\"\")","v":"Plow Horse"},{"$f":"IFERROR(IF(J27=\"\",D26,E27*J27),D26)","v":23983},{"$f":"IFERROR(IF(K27=\"\",E26,K27*$F$3),E26)","v":827},{"$f":"IFERROR(D27*H27,F26)","v":8774.4699999999993},{"$f":"IFERROR(IF(E27=\"\",G26,E27/$E$160),G26)","v":7.7630714352764474E-2},{"$f":"IFERROR(IF(L27=\"\",H26,L27/J27),H26)","v":0.36586206896551721},{"$f":"IFERROR((J27-L27)/J27,\"\")","v":0.63413793103448279},{"$f":"J26","v":29},{"$f":"K26","v":0.48992890995260663},{"$f":"L26","v":10.61}]
[]
["Baseline",{"$f":"'Cat 1 Setup (example to overide'!A16","v":"NEW YORK STRIP"},{"$f":"IFERROR(IF(AND(I29>$I$159,G29>$G$159),\"Star\",IF(AND(I29>$I$159,G29<$G$159),\"Puzzle\",IF(AND(I29<$I$159,G29>$G$159),\"Plow Horse\",\"Dog\"))),\"\")","v":"Plow Horse"},{"$f":"IFERROR(VLOOKUP(B29,'Cat 1 Setup (example to overide'!$A:$F,4,FALSE),\"\")","v":26176},{"$f":"IFERROR(VLOOKUP(B29,'Cat 1 Setup (example to overide'!$A:$F,3,FALSE),\"\")","v":818},{"$f":"IFERROR(VLOOKUP(B29,'Cat 1 Setup (example to overide'!$A:$F,6,FALSE),\"\")","v":10259.9},{"$f":"IFERROR(E29/$E$159,\"\")","v":7.6785881911198728E-2},{"$f":"IFERROR(F29/D29,\"\")","v":0.39195828239608799},{"$f":"IFERROR((J29-L29)/J29,\"\")","v":0.60804171760391201},{"$f":"IFERROR(D29/E29,\"\")","v":32},{"$f":"IFERROR(E29/$F$3,\"\")","v":0.48459715639810425},{"$f":"IFERROR(J29*H29,\"\")","v":12.542665036674816}]
["Proposed",null,{"$f":"IFERROR(IF(AND(I30>$I$160,G30>$G$160),\"Star\",IF(AND(I30>$I$160,G30<$G$160),\"Puzzle\",IF(AND(I30<$I$160,G30>$G$160),\"Plow Horse\",\"Dog\"))),\"\")","v":"Plow Horse"},{"$f":"IFERROR(IF(J30=\"\",D29,E30*J30),D29)","v":26176},{"$f":"IFERROR(IF(K30=\"\",E29,K30*$F$3),E29)","v":818},{"$f":"IFERROR(D30*H30,F29)","v":10259.9},{"$f":"IFERROR(IF(E30=\"\",G29,E30/$E$160),G29)","v":7.6785881911198728E-2},{"$f":"IFERROR(IF(L30=\"\",H29,L30/J30),H29)","v":0.39195828239608799},{"$f":"IFERROR((J30-L30)/J30,\"\")","v":0.60804171760391201},{"$f":"J29","v":32},{"$f":"K29","v":0.48459715639810425},{"$f":"L29","v":12.542665036674816}]
[]
["Baseline",{"$f":"'Cat 1 Setup (example to overide'!A17","v":"SPAGHETTI BOLOGNESE"},{"$f":"IFERROR(IF(AND(I32>$I$159,G32>$G$159),\"Star\",IF(AND(I32>$I$159,G32<$G$159),\"Puzzle\",IF(AND(I32<$I$159,G32>$G$159),\"Plow Horse\",\"Dog\"))),\"\")","v":"Star"},{"$f":"IFERROR(VLOOKUP(B32,'Cat 1 Setup (example to overide'!$A:$F,4,FALSE),\"\")","v":9792},{"$f":"IFERROR(VLOOKUP(B32,'Cat 1 Setup (example to overide'!$A:$F,3,FALSE),\"\")","v":612},{"$f":"IFERROR(VLOOKUP(B32,'Cat 1 Setup (example to overide'!$A:$F,6,FALSE),\"\")","v":1933.92},{"$f":"IFERROR(E32/$E$159,\"\")","v":5.7448606026471415E-2},{"$f":"IFERROR(F32/D32,\"\")","v":0.19750000000000001},{"$f":"IFERROR((J32-L32)/J32,\"\")","v":0.80249999999999999},{"$f":"IFERROR(D32/E32,\"\")","v":16},{"$f":"IFERROR(E32/$F$3,\"\")","v":0.36255924170616116},{"$f":"IFERROR(J32*H32,\"\")","v":3.16}]
["Proposed",null,{"$f":"IFERROR(IF(AND(I33>$I$160,G33>$G$160),\"Star\",IF(AND(I33>$I$160,G33<$G$160),\"Puzzle\",IF(AND(I33<$I$160,G33>$G$160),\"Plow Horse\",\"Dog\"))),\"\")","v":"Star"},{"$f":"IFERROR(IF(J33=\"\",D32,E33*J33),D32)","v":9792},{"$f":"IFERROR(IF(K33=\"\",E32,K33*$F$3),E32)","v":612},{"$f":"IFERROR(D33*H33,F32)","v":1933.92},{"$f":"IFERROR(IF(E33=\"\",G32,E33/$E$160),G32)","v":5.7448606026471415E-2},{"$f":"IFERROR(IF(L33=\"\",H32,L33/J33),H32)","v":0.19750000000000001},{"$f":"IFERROR((J33-L33)/J33,\"\")","v":0.80249999999999999},{"$f":"J32","v":16},{"$f":"K32","v":0.36255924170616116},{"$f":"L32","v":3.16}]
[]
["Baseline",{"$f":"'Cat 1 Setup (example to overide'!A18","v":"SEARED SEA SCALLOPS"},{"$f":"IFERROR(IF(AND(I35>$I$159,G35>$G$159),\"Star\",IF(AND(I35>$I$159,G35<$G$159),\"Puzzle\",IF(AND(I35<$I$159,G35>$G$159),\"Plow Horse\",\"Dog\"))),\"\")","v":"Star"},{"$f":"IFERROR(VLOOKUP(B35,'Cat 1 Setup (example to overide'!$A:$F,4,FALSE),\"\")","v":15792},{"$f":"IFERROR(VLOOKUP(B35,'Cat 1 Setup (example to overide'!$A:$F,3,FALSE),\"\")","v":564},{"$f":"IFERROR(VLOOKUP(B35,'Cat 1 Setup (example to overide'!$A:$F,6,FALSE),\"\")","v":5306.26},{"$f":"IFERROR(E35/$E$159,\"\")","v":5.294283300478738E-2},{"$f":"IFERROR(F35/D35,\"\")","v":0.33600937183383994},{"$f":"IFERROR((J35-L35)/J35,\"\")","v":0.66399062816616006},{"$f":"IFERROR(D35/E35,\"\")","v":28},{"$f":"IFERROR(E35/$F$3,\"\")","v":0.33412322274881517},{"$f":"IFERROR(J35*H35,\"\")","v":9.4082624113475184}]
["Proposed",null,{"$f":"IFERROR(IF(AND(I36>$I$160,G36>$G$160),\"Star\",IF(AND(I36>$I$160,G36<$G$160),\"Puzzle\",IF(AND(I36<$I$160,G36>$G$160),\"Plow Horse\",\"Dog\"))),\"\")","v":"Star"},{"$f":"IFERROR(IF(J36=\"\",D35,E36*J36),D35)","v":15792},{"$f":"IFERROR(IF(K36=\"\",E35,K36*$F$3),E35)","v":564},{"$f":"IFERROR(D36*H36,F35)","v":5306.26},{"$f":"IFERROR(IF(E36=\"\",G35,E36/$E$160),G35)","v":5.294283300478738E-2},{"$f":"IFERROR(IF(L36=\"\",H35,L36/J36),H35)","v":0.33600937183383994},{"$f":"IFERROR((J36-L36)/J36,\"\")","v":0.66399062816616006},{"$f":"J35","v":28},{"$f":"K35","v":0.33412322274881517},{"$f":"L35","v":9.4082624113475184}]
[]
["Baseline",{"$f":"'Cat 1 Setup (example to overide'!A19","v":"OMELET"},{"$f":"IFERROR(IF(AND(I38>$I$159,G38>$G$159),\"Star\",IF(AND(I38>$I$159,G38<$G$159),\"Puzzle\",IF(AND(I38<$I$159,G38>$G$159),\"Plow Horse\",\"Dog\"))),\"\")","v":"Puzzle"},{"$f":"IFERROR(VLOOKUP(B38,'Cat 1 Setup (example to overide'!$A:$F,4,FALSE),\"\")","v":5564},{"$f":"IFERROR(VLOOKUP(B38,'Cat 1 Setup (example to overide'!$A:$F,3,FALSE),\"\")","v":428},{"$f":"IFERROR(VLOOKUP(B38,'Cat 1 Setup (example to overide'!$A:$F,6,FALSE),\"\")","v":1429.52},{"$f":"IFERROR(E38/$E$159,\"\")","v":4.0176476110015957E-2},{"$f":"IFERROR(F38/D38,\"\")","v":0.25692307692307692},{"$f":"IFERROR((J38-L38)/J38,\"\")","v":0.74307692307692308},{"$f":"IFERROR(D38/E38,\"\")","v":13},{"$f":"IFERROR(E38/$F$3,\"\")","v":0.25355450236966826},{"$f":"IFERROR(J38*H38,\"\")","v":3.34}]
["Proposed",null,{"$f":"IFERROR(IF(AND(I39>$I$160,G39>$G$160),\"Star\",IF(AND(I39>$I$160,G39<$G$160),\"Puzzle\",IF(AND(I39<$I$160,G39>$G$160),\"Plow Horse\",\"Dog\"))),\"\")","v":"Puzzle"},{"$f":"IFERROR(IF(J39=\"\",D38,E39*J39),D38)","v":5564},{"$f":"IFERROR(IF(K39=\"\",E38,K39*$F$3),E38)","v":428},{"$f":"IFERROR(D39*H39,F38)","v":1429.52},{"$f":"IFERROR(IF(E39=\"\",G38,E39/$E$160),G38)","v":4.0176476110015957E-2},{"$f":"IFERROR(IF(L39=\"\",H38,L39/J39),H38)","v":0.25692307692307692},{"$f":"IFERROR((J39-L39)/J39,\"\")","v":0.74307692307692308},{"$f":"J38","v":13},{"$f":"K38","v":0.25355450236966826},{"$f":"L38","v":3.34}]
[]
["Baseline",{"$f":"'Cat 1 Setup (example to overide'!A20","v":"ENTREE OF RAVIOLI"},{"$f":"IFERROR(IF(AND(I41>$I$159,G41>$G$159),\"Star\",IF(AND(I41>$I$159,G41<$G$159),\"Puzzle\",IF(AND(I41<$I$159,G41>$G$159),\"Plow Horse\",\"Dog\"))),\"\")","v":"Puzzle"},{"$f":"IFERROR(VLOOKUP(B41,'Cat 1 Setup (example to overide'!$A:$F,4,FALSE),\"\")","v":7080},{"$f":"IFERROR(VLOOKUP(B41,'Cat 1 Setup (example to overide'!$A:$F,3,FALSE),\"\")","v":354},{"$f":"IFERROR(VLOOKUP(B41,'Cat 1 Setup (example to overide'!$A:$F,6,FALSE),\"\")","v":934.56},{"$f":"IFERROR(E41/$E$159,\"\")","v":3.3230076034919738E-2},{"$f":"IFERROR(F41/D41,\"\")","v":0.13199999999999998},{"$f":"IFERROR((J41-L41)/J41,\"\")","v":0.86799999999999999},{"$f":"IFERROR(D41/E41,\"\")","v":20},{"$f":"IFERROR(E41/$F$3,\"\")","v":0.20971563981042654},{"$f":"IFERROR(J41*H41,\"\")","v":2.6399999999999997}]
["Proposed",null,{"$f":"IFERROR(IF(AND(I42>$I$160,G42>$G$160),\"Star\",IF(AND(I42>$I$160,G42<$G$160),\"Puzzle\",IF(AND(I42<$I$160,G42>$G$160),\"Plow Horse\",\"Dog\"))),\"\")","v":"Puzzle"},{"$f":"IFERROR(IF(J42=\"\",D41,E42*J42),D41)","v":7080},{"$f":"IFERROR(IF(K42=\"\",E41,K42*$F$3),E41)","v":354},{"$f":"IFERROR(D42*H42,F41)","v":934.55999999999983},{"$f":"IFERROR(IF(E42=\"\",G41,E42/$E$160),G41)","v":3.3230076034919738E-2},{"$f":"IFERROR(IF(L42=\"\",H41,L42/J42),H41)","v":0.13199999999999998},{"$f":"IFERROR((J42-L42)/J42,\"\")","v":0.86799999999999999},{"$f":"J41","v":20},{"$f":"K41","v":0.20971563981042654},{"$f":"L41","v":2.6399999999999997}]
[]
["Baseline",{"$f":"'Cat 1 Setup (example to overide'!A21","v":"DOVER SOLE"},{"$f":"IFERROR(IF(AND(I44>$I$159,G44>$G$159),\"Star\",IF(AND(I44>$I$159,G44<$G$159),\"Puzzle\",IF(AND(I44<$I$159,G44>$G$159),\"Plow Horse\",\"Dog\"))),\"\")","v":"Dog"},{"$f":"IFERROR(VLOOKUP(B44,'Cat 1 Setup (example to overide'!$A:$F,4,FALSE),\"\")","v":7750},{"$f":"IFERROR(VLOOKUP(B44,'Cat 1 Setup (example to overide'!$A:$F,3,FALSE),\"\")","v":250},{"$f":"IFERROR(VLOOKUP(B44,'Cat 1 Setup (example to overide'!$A:$F,6,FALSE),\"\")","v":5042.5},{"$f":"IFERROR(E44/$E$159,\"\")","v":2.3467567821271004E-2},{"$f":"IFERROR(F44/D44,\"\")","v":0.65064516129032257},{"$f":"IFERROR((J44-L44)/J44,\"\")","v":0.34935483870967748},{"$f":"IFERROR(D44/E44,\"\")","v":31},{"$f":"IFERROR(E44/$F$3,\"\")","v":0.1481042654028436},{"$f":"IFERROR(J44*H44,\"\")","v":20.169999999999998}]
["Proposed",null,{"$f":"IFERROR(IF(AND(I45>$I$160,G45>$G$160),\"Star\",IF(AND(I45>$I$160,G45<$G$160),\"Puzzle\",IF(AND(I45<$I$160,G45>$G$160),\"Plow Horse\",\"Dog\"))),\"\")","v":"Dog"},{"$f":"IFERROR(IF(J45=\"\",D44,E45*J45),D44)","v":7750},{"$f":"IFERROR(IF(K45=\"\",E44,K45*$F$3),E44)","v":250},{"$f":"IFERROR(D45*H45,F44)","v":5042.5},{"$f":"IFERROR(IF(E45=\"\",G44,E45/$E$160),G44)","v":2.3467567821271004E-2},{"$f":"IFERROR(IF(L45=\"\",H44,L45/J45),H44)","v":0.65064516129032257},{"$f":"IFERROR((J45-L45)/J45,\"\")","v":0.34935483870967748},{"$f":"J44","v":31},{"$f":"K44","v":0.1481042654028436},{"$f":"L44","v":20.169999999999998}]
[]
["Baseline",{"$f":"'Cat 1 Setup (example to overide'!A22","v":"LOUP DE MER"},{"$f":"IFERROR(IF(AND(I47>$I$159,G47>$G$159),\"Star\",IF(AND(I47>$I$159,G47<$G$159),\"Puzzle\",IF(AND(I47<$I$159,G47>$G$159),\"Plow Horse\",\"Dog\"))),\"\")","v":"Dog"},{"$f":"IFERROR(VLOOKUP(B47,'Cat 1 Setup (example to overide'!$A:$F,4,FALSE),\"\")","v":5564},{"$f":"IFERROR(VLOOKUP(B47,'Cat 1 Setup (example to overide'!$A:$F,3,FALSE),\"\")","v":214},{"$f":"IFERROR(VLOOKUP(B47,'Cat 1 Setup (example to overide'!$A:$F,6,FALSE),\"\")","v":2334.7399999999998},{"$f":"IFERROR(E47/$E$159,\"\")","v":2.0088238055007979E-2},{"$f":"IFERROR(F47/D47,\"\")","v":0.41961538461538456},{"$f":"IFERROR((J47-L47)/J47,\"\")","v":0.5803846153846155},{"$f":"IFERROR(D47/E47,\"\")","v":26},{"$f":"IFERROR(E47/$F$3,\"\")","v":0.12677725118483413},{"$f":"IFERROR(J47*H47,\"\")","v":10.909999999999998}]
["Proposed",null,{"$f":"IFERROR(IF(AND(I48>$I$160,G48>$G$160),\"Star\",IF(AND(I48>$I$160,G48<$G$160),\"Puzzle\",IF(AND(I48<$I$160,G48>$G$160),\"Plow Horse\",\"Dog\"))),\"\")","v":"Dog"},{"$f":"IFERROR(IF(J48=\"\",D47,E48*J48),D47)","v":5564},{"$f":"IFERROR(IF(K48=\"\",E47,K48*$F$3),E47)","v":214},{"$f":"IFERROR(D48*H48,F47)","v":2334.7399999999998},{"$f":"IFERROR(IF(E48=\"\",G47,E48/$E$160),G47)","v":2.0088238055007979E-2},{"$f":"IFERROR(IF(L48=\"\",H47,L48/J48),H47)","v":0.41961538461538456},{"$f":"IFERROR((J48-L48)/J48,\"\")","v":0.5803846153846155},{"$f":"J47","v":26},{"$f":"K47","v":0.12677725118483413},{"$f":"L47","v":10.909999999999998}]
[]
["Baseline",{"$f":"'Cat 1 Setup (example to overide'!A23","v":"BOUILLABAISSE"},{"$f":"IFERROR(IF(AND(I50>$I$159,G50>$G$159),\"Star\",IF(AND(I50>$I$159,G50<$G$159),\"Puzzle\",IF(AND(I50<$I$159,G50>$G$159),\"Plow Horse\",\"Dog\"))),\"\")","v":"Dog"},{"$f":"IFERROR(VLOOKUP(B50,'Cat 1 Setup (example to overide'!$A:$F,4,FALSE),\"\")","v":5544},{"$f":"IFERROR(VLOOKUP(B50,'Cat 1 Setup (example to overide'!$A:$F,3,FALSE),\"\")","v":198},{"$f":"IFERROR(VLOOKUP(B50,'Cat 1 Setup (example to overide'!$A:$F,6,FALSE),\"\")","v":2142.36},{"$f":"IFERROR(E50/$E$159,\"\")","v":1.8586313714446634E-2},{"$f":"IFERROR(F50/D50,\"\")","v":0.38642857142857145},{"$f":"IFERROR((J50-L50)/J50,\"\")","v":0.61357142857142855},{"$f":"IFERROR(D50/E50,\"\")","v":28},{"$f":"IFERROR(E50/$F$3,\"\")","v":0.11729857819905214},{"$f":"IFERROR(J50*H50,\"\")","v":10.82}]
["Proposed",null,{"$f":"IFERROR(IF(AND(I51>$I$160,G51>$G$160),\"Star\",IF(AND(I51>$I$160,G51<$G$160),\"Puzzle\",IF(AND(I51<$I$160,G51>$G$160),\"Plow Horse\",\"Dog\"))),\"\")","v":"Dog"},{"$f":"IFERROR(IF(J51=\"\",D50,E51*J51),D50)","v":5544},{"$f":"IFERROR(IF(K51=\"\",E50,K51*$F$3),E50)","v":198},{"$f":"IFERROR(D51*H51,F50)","v":2142.36},{"$f":"IFERROR(IF(E51=\"\",G50,E51/$E$160),G50)","v":1.8586313714446634E-2},{"$f":"IFERROR(IF(L51=\"\",H50,L51/J51),H50)","v":0.38642857142857145},{"$f":"IFERROR((J51-L51)/J51,\"\")","v":0.61357142857142855},{"$f":"J50","v":28},{"$f":"K50","v":0.11729857819905214},{"$f":"L50","v":10.82}]
[]
["Baseline",{"$f":"'Cat 1 Setup (example to overide'!A24","v":"DUNGENESS CRAB SPAGHETTI"},{"$f":"IFERROR(IF(AND(I53>$I$159,G53>$G$159),\"Star\",IF(AND(I53>$I$159,G53<$G$159),\"Puzzle\",IF(AND(I53<$I$159,G53>$G$159),\"Plow Horse\",\"Dog\"))),\"\")","v":"Dog"},{"$f":"IFERROR(VLOOKUP(B53,'Cat 1 Setup (example to overide'!$A:$F,4,FALSE),\"\")","v":6112},{"$f":"IFERROR(VLOOKUP(B53,'Cat 1 Setup (example to overide'!$A:$F,3,FALSE),\"\")","v":191},{"$f":"IFERROR(VLOOKUP(B53,'Cat 1 Setup (example to overide'!$A:$F,6,FALSE),\"\")","v":2175.4899999999998},{"$f":"IFERROR(E53/$E$159,\"\")","v":1.7929221815451046E-2},{"$f":"IFERROR(F53/D53,\"\")","v":0.35593749999999996},{"$f":"IFERROR((J53-L53)/J53,\"\")","v":0.64406249999999998},{"$f":"IFERROR(D53/E53,\"\")","v":32},{"$f":"IFERROR(E53/$F$3,\"\")","v":0.11315165876777251},{"$f":"IFERROR(J53*H53,\"\")","v":11.389999999999999}]
["Proposed",null,{"$f":"IFERROR(IF(AND(I54>$I$160,G54>$G$160),\"Star\",IF(AND(I54>$I$160,G54<$G$160),\"Puzzle\",IF(AND(I54<$I$160,G54>$G$160),\"Plow Horse\",\"Dog\"))),\"\")","v":"Dog"},{"$f":"IFERROR(IF(J54=\"\",D53,E54*J54),D53)","v":6112},{"$f":"IFERROR(IF(K54=\"\",E53,K54*$F$3),E53)","v":191},{"$f":"IFERROR(D54*H54,F53)","v":2175.4899999999998},{"$f":"IFERROR(IF(E54=\"\",G53,E54/$E$160),G53)","v":1.7929221815451046E-2},{"$f":"IFERROR(IF(L54=\"\",H53,L54/J54),H53)","v":0.35593749999999996},{"$f":"IFERROR((J54-L54)/J54,\"\")","v":0.64406249999999998},{"$f":"J53","v":32},{"$f":"K53","v":0.11315165876777251},{"$f":"L53","v":11.389999999999999}]
[]
["Baseline",{"$f":"'Cat 1 Setup (example to overide'!A25","v":"FARFALLE"},{"$f":"IFERROR(IF(AND(I56>$I$159,G56>$G$159),\"Star\",IF(AND(I56>$I$159,G56<$G$159),\"Puzzle\",IF(AND(I56<$I$159,G56>$G$159),\"Plow Horse\",\"Dog\"))),\"\")","v":"Puzzle"},{"$f":"IFERROR(VLOOKUP(B56,'Cat 1 Setup (example to overide'!$A:$F,4,FALSE),\"\")","v":2960},{"$f":"IFERROR(VLOOKUP(B56,'Cat 1 Setup (example to overide'!$A:$F,3,FALSE),\"\")","v":185},{"$f":"IFERROR(VLOOKUP(B56,'Cat 1 Setup (example to overide'!$A:$F,6,FALSE),\"\")","v":595.70000000000005},{"$f":"IFERROR(E56/$E$159,\"\")","v":1.7366000187740541E-2},{"$f":"IFERROR(F56/D56,\"\")","v":0.20125000000000001},{"$f":"IFERROR((J56-L56)/J56,\"\")","v":0.79874999999999996},{"$f":"IFERROR(D56/E56,\"\")","v":16},{"$f":"IFERROR(E56/$F$3,\"\")","v":0.10959715639810426},{"$f":"IFERROR(J56*H56,\"\")","v":3.22}]
["Proposed",null,{"$f":"IFERROR(IF(AND(I57>$I$160,G57>$G$160),\"Star\",IF(AND(I57>$I$160,G57<$G$160),\"Puzzle\",IF(AND(I57<$I$160,G57>$G$160),\"Plow Horse\",\"Dog\"))),\"\")","v":"Puzzle"},{"$f":"IFERROR(IF(J57=\"\",D56,E57*J57),D56)","v":2960},{"$f":"IFERROR(IF(K57=\"\",E56,K57*$F$3),E56)","v":185},{"$f":"IFERROR(D57*H57,F56)","v":595.70000000000005},{"$f":"IFERROR(IF(E57=\"\",G56,E57/$E$160),G56)","v":1.7366000187740541E-2},{"$f":"IFERROR(IF(L57=\"\",H56,L57/J57),H56)","v":0.20125000000000001},{"$f":"IFERROR((J57-L57)/J57,\"\")","v":0.79874999999999996},{"$f":"J56","v":16},{"$f":"K56","v":0.10959715639810426},{"$f":"L56","v":3.22}]
[]
["Baseline",{"$f":"'Cat 1 Setup (example to overide'!A26","v":"VEAL MEDALLIONS"},{"$f":"IFERROR(IF(AND(I59>$I$159,G59>$G$159),\"Star\",IF(AND(I59>$I$159,G59<$G$159),\"Puzzle\",IF(AND(I59<$I$159,G59>$G$159),\"Plow Horse\",\"Dog\"))),\"\")","v":"Dog"},{"$f":"IFERROR(VLOOKUP(B59,'Cat 1 Setup (example to overide'!$A:$F,4,FALSE),\"\")","v":6188},{"$f":"IFERROR(VLOOKUP(B59,'Cat 1 Setup (example to overide'!$A:$F,3,FALSE),\"\")","v":182},{"$f":"IFERROR(VLOOKUP(B59,'Cat 1 Setup (example to overide'!$A:$F,6,FALSE),\"\")","v":2305.94},{"$f":"IFERROR(E59/$E$159,\"\")","v":1.7084389373885289E-2},{"$f":"IFERROR(F59/D59,\"\")","v":0.37264705882352944},{"$f":"IFERROR((J59-L59)/J59,\"\")","v":0.62735294117647056},{"$f":"IFERROR(D59/E59,\"\")","v":34},{"$f":"IFERROR(E59/$F$3,\"\")","v":0.10781990521327015},{"$f":"IFERROR(J59*H59,\"\")","v":12.670000000000002}]
["Proposed",null,{"$f":"IFERROR(IF(AND(I60>$I$160,G60>$G$160),\"Star\",IF(AND(I60>$I$160,G60<$G$160),\"Puzzle\",IF(AND(I60<$I$160,G60>$G$160),\"Plow Horse\",\"Dog\"))),\"\")","v":"Dog"},{"$f":"IFERROR(IF(J60=\"\",D59,E60*J60),D59)","v":6188},{"$f":"IFERROR(IF(K60=\"\",E59,K60*$F$3),E59)","v":182},{"$f":"IFERROR(D60*H60,F59)","v":2305.94},{"$f":"IFERROR(IF(E60=\"\",G59,E60/$E$160),G59)","v":1.7084389373885289E-2},{"$f":"IFERROR(IF(L60=\"\",H59,L60/J60),H59)","v":0.37264705882352944},{"$f":"IFERROR((J60-L60)/J60,\"\")","v":0.62735294117647056},{"$f":"J59","v":34},{"$f":"K59","v":0.10781990521327015},{"$f":"L59","v":12.670000000000002}]
[]
["Baseline",{"$f":"'Cat 1 Setup (example to overide'!A27","v":"LOBSTER AMERICAINE"},{"$f":"IFERROR(IF(AND(I62>$I$159,G62>$G$159),\"Star\",IF(AND(I62>$I$159,G62<$G$159),\"Puzzle\",IF(AND(I62<$I$159,G62>$G$159),\"Plow Horse\",\"Dog\"))),\"\")","v":"Dog"},{"$f":"IFERROR(VLOOKUP(B62,'Cat 1 Setup (example to overide'!$A:$F,4,FALSE),\"\")","v":5478},{"$f":"IFERROR(VLOOKUP(B62,'Cat 1 Setup (example to overide'!$A:$F,3,FALSE),\"\")","v":166},{"$f":"IFERROR(VLOOKUP(B62,'Cat 1 Setup (example to overide'!$A:$F,6,FALSE),\"\")","v":2184.56},{"$f":"IFERROR(E62/$E$159,\"\")","v":1.5582465033323946E-2},{"$f":"IFERROR(F62/D62,\"\")","v":0.3987878787878788},{"$f":"IFERROR((J62-L62)/J62,\"\")","v":0.6012121212121212},{"$f":"IFERROR(D62/E62,\"\")","v":33},{"$f":"IFERROR(E62/$F$3,\"\")","v":9.8341232227488154E-2},{"$f":"IFERROR(J62*H62,\"\")","v":13.16}]
["Proposed",null,{"$f":"IFERROR(IF(AND(I63>$I$160,G63>$G$160),\"Star\",IF(AND(I63>$I$160,G63<$G$160),\"Puzzle\",IF(AND(I63<$I$160,G63>$G$160),\"Plow Horse\",\"Dog\"))),\"\")","v":"Dog"},{"$f":"IFERROR(IF(J63=\"\",D62,E63*J63),D62)","v":5478},{"$f":"IFERROR(IF(K63=\"\",E62,K63*$F$3),E62)","v":166},{"$f":"IFERROR(D63*H63,F62)","v":2184.56},{"$f":"IFERROR(IF(E63=\"\",G62,E63/$E$160),G62)","v":1.5582465033323946E-2},{"$f":"IFERROR(IF(L63=\"\",H62,L63/J63),H62)","v":0.3987878787878788},{"$f":"IFERROR((J63-L63)/J63,\"\")","v":0.6012121212121212},{"$f":"J62","v":33},{"$f":"K62","v":9.8341232227488154E-2},{"$f":"L62","v":13.16}]
[]
["Baseline",{"$f":"'Cat 1 Setup (example to overide'!A28","v":"PORK MILANESE"},{"$f":"IFERROR(IF(AND(I65>$I$159,G65>$G$159),\"Star\",IF(AND(I65>$I$159,G65<$G$159),\"Puzzle\",IF(AND(I65<$I$159,G65>$G$159),\"Plow Horse\",\"Dog\"))),\"\")","v":"Puzzle"},{"$f":"IFERROR(VLOOKUP(B65,'Cat 1 Setup (example to overide'!$A:$F,4,FALSE),\"\")","v":4238},{"$f":"IFERROR(VLOOKUP(B65,'Cat 1 Setup (example to overide'!$A:$F,3,FALSE),\"\")","v":163},{"$f":"IFERROR(VLOOKUP(B65,'Cat 1 Setup (example to overide'!$A:$F,6,FALSE),\"\")","v":1219.24},{"$f":"IFERROR(E65/$E$159,\"\")","v":1.5300854219468694E-2},{"$f":"IFERROR(F65/D65,\"\")","v":0.28769230769230769},{"$f":"IFERROR((J65-L65)/J65,\"\")","v":0.71230769230769231},{"$f":"IFERROR(D65/E65,\"\")","v":26},{"$f":"IFERROR(E65/$F$3,\"\")","v":9.6563981042654026E-2},{"$f":"IFERROR(J65*H65,\"\")","v":7.48}]
["Proposed",null,{"$f":"IFERROR(IF(AND(I66>$I$160,G66>$G$160),\"Star\",IF(AND(I66>$I$160,G66<$G$160),\"Puzzle\",IF(AND(I66<$I$160,G66>$G$160),\"Plow Horse\",\"Dog\"))),\"\")","v":"Puzzle"},{"$f":"IFERROR(IF(J66=\"\",D65,E66*J66),D65)","v":4238},{"$f":"IFERROR(IF(K66=\"\",E65,K66*$F$3),E65)","v":163},{"$f":"IFERROR(D66*H66,F65)","v":1219.24},{"$f":"IFERROR(IF(E66=\"\",G65,E66/$E$160),G65)","v":1.5300854219468694E-2},{"$f":"IFERROR(IF(L66=\"\",H65,L66/J66),H65)","v":0.28769230769230769},{"$f":"IFERROR((J66-L66)/J66,\"\")","v":0.71230769230769231},{"$f":"J65","v":26},{"$f":"K65","v":9.6563981042654026E-2},{"$f":"L65","v":7.48}]
[]
["Baseline",{"$f":"'Cat 1 Setup (example to overide'!A29","v":0},{"$f":"IFERROR(IF(AND(I68>$I$159,G68>$G$159),\"Star\",IF(AND(I68>$I$159,G68<$G$159),\"Puzzle\",IF(AND(I68<$I$159,G68>$G$159),\"Plow Horse\",\"Dog\"))),\"\")","v":"Puzzle"},{"$f":"IFERROR(VLOOKUP(B68,'Cat 1 Setup (example to overide'!$A:$F,4,FALSE),\"\")","v":0},{"$f":"IFERROR(VLOOKUP(B68,'Cat 1 Setup (example to overide'!$A:$F,3,FALSE),\"\")","v":0},{"$f":"IFERROR(VLOOKUP(B68,'Cat 1 Setup (example to overide'!$A:$F,6,FALSE),\"\")","v":0},{"$f":"IFERROR(E68/$E$159,\"\")","v":0},{"$f":"IFERROR(F68/D68,\"\")","v":""},{"$f":"IFERROR((J68-L68)/J68,\"\")","v":""},{"$f":"IFERROR(D68/E68,\"\")","v":""},{"$f":"IFERROR(E68/$F$3,\"\")","v":0},{"$f":"IFERROR(J68*H68,\"\")","v":""}]
["Proposed",null,{"$f":"IFERROR(IF(AND(I69>$I$160,G69>$G$160),\"Star\",IF(AND(I69>$I$160,G69<$G$160),\"Puzzle\",IF(AND(I69<$I$160,G69>$G$160),\"Plow Horse\",\"Dog\"))),\"\")","v":"Puzzle"},{"$f":"IFERROR(IF(J69=\"\",D68,E69*J69),D68)","v":0},{"$f":"IFERROR(IF(K69=\"\",E68,K69*$F$3),E68)","v":0},{"$f":"IFERROR(D69*H69,F68)","v":0},{"$f":"IFERROR(IF(E69=\"\",G68,E69/$E$160),G68)","v":0},{"$f":"IFERROR(IF(L69=\"\",H68,L69/J69),H68)","v":""},{"$f":"IFERROR((J69-L69)/J69,\"\")","v":""},{"$f":"J68","v":""},{"$f":"K68","v":0},{"$f":"L68","v":""}]
[]
["Baseline",{"$f":"'Cat 1 Setup (example to overide'!A30","v":0},{"$f":"IFERROR(IF(AND(I71>$I$159,G71>$G$159),\"Star\",IF(AND(I71>$I$159,G71<$G$159),\"Puzzle\",IF(AND(I71<$I$159,G71>$G$159),\"Plow Horse\",\"Dog\"))),\"\")","v":"Puzzle"},{"$f":"IFERROR(VLOOKUP(B71,'Cat 1 Setup (example to overide'!$A:$F,4,FALSE),\"\")","v":0},{"$f":"IFERROR(VLOOKUP(B71,'Cat 1 Setup (example to overide'!$A:$F,3,FALSE),\"\")","v":0},{"$f":"IFERROR(VLOOKUP(B71,'Cat 1 Setup (example to overide'!$A:$F,6,FALSE),\"\")","v":0},{"$f":"IFERROR(E71/$E$159,\"\")","v":0},{"$f":"IFERROR(F71/D71,\"\")","v":""},{"$f":"IFERROR((J71-L71)/J71,\"\")","v":""},{"$f":"IFERROR(D71/E71,\"\")","v":""},{"$f":"IFERROR(E71/$F$3,\"\")","v":0},{"$f":"IFERROR(J71*H71,\"\")","v":""}]
["Proposed",null,{"$f":"IFERROR(IF(AND(I72>$I$160,G72>$G$160),\"Star\",IF(AND(I72>$I$160,G72<$G$160),\"Puzzle\",IF(AND(I72<$I$160,G72>$G$160),\"Plow Horse\",\"Dog\"))),\"\")","v":"Puzzle"},{"$f":"IFERROR(IF(J72=\"\",D71,E72*J72),D71)","v":0},{"$f":"IFERROR(IF(K72=\"\",E71,K72*$F$3),E71)","v":0},{"$f":"IFERROR(D72*H72,F71)","v":0},{"$f":"IFERROR(IF(E72=\"\",G71,E72/$E$160),G71)","v":0},{"$f":"IFERROR(IF(L72=\"\",H71,L72/J72),H71)","v":""},{"$f":"IFERROR((J72-L72)/J72,\"\")","v":""},{"$f":"J71","v":""},{"$f":"K71","v":0},{"$f":"L71","v":""}]
[]
["Baseline",{"$f":"'Cat 1 Setup (example to overide'!A31","v":0},{"$f":"IFERROR(IF(AND(I74>$I$159,G74>$G$159),\"Star\",IF(AND(I74>$I$159,G74<$G$159),\"Puzzle\",IF(AND(I74<$I$159,G74>$G$159),\"Plow Horse\",\"Dog\"))),\"\")","v":"Puzzle"},{"$f":"IFERROR(VLOOKUP(B74,'Cat 1 Setup (example to overide'!$A:$F,4,FALSE),\"\")","v":0},{"$f":"IFERROR(VLOOKUP(B74,'Cat 1 Setup (example to overide'!$A:$F,3,FALSE),\"\")","v":0},{"$f":"IFERROR(VLOOKUP(B74,'Cat 1 Setup (example to overide'!$A:$F,6,FALSE),\"\")","v":0},{"$f":"IFERROR(E74/$E$159,\"\")","v":0},{"$f":"IFERROR(F74/D74,\"\")","v":""},{"$f":"IFERROR((J74-L74)/J74,\"\")","v":""},{"$f":"IFERROR(D74/E74,\"\")","v":""},{"$f":"IFERROR(E74/$F$3,\"\")","v":0},{"$f":"IFERROR(J74*H74,\"\")","v":""}]
["Proposed",null,{"$f":"IFERROR(IF(AND(I75>$I$160,G75>$G$160),\"Star\",IF(AND(I75>$I$160,G75<$G$160),\"Puzzle\",IF(AND(I75<$I$160,G75>$G$160),\"Plow Horse\",\"Dog\"))),\"\")","v":"Puzzle"},{"$f":"IFERROR(IF(J75=\"\",D74,E75*J75),D74)","v":0},{"$f":"IFERROR(IF(K75=\"\",E74,K75*$F$3),E74)","v":0},{"$f":"IFERROR(D75*H75,F74)","v":0},{"$f":"IFERROR(IF(E75=\"\",G74,E75/$E$160),G74)","v":0},{"$f":"IFERROR(IF(L75=\"\",H74,L75/J75),H74)","v":""},{"$f":"IFERROR((J75-L75)/J75,\"\")","v":""},{"$f":"J74","v":""},{"$f":"K74","v":0},{"$f":"L74","v":""}]
[]
["Baseline",{"$f":"'Cat 1 Setup (example to overide'!A32","v":0},{"$f":"IFERROR(IF(AND(I77>$I$159,G77>$G$159),\"Star\",IF(AND(I77>$I$159,G77<$G$159),\"Puzzle\",IF(AND(I77<$I$159,G77>$G$159),\"Plow Horse\",\"Dog\"))),\"\")","v":"Puzzle"},{"$f":"IFERROR(VLOOKUP(B77,'Cat 1 Setup (example to overide'!$A:$F,4,FALSE),\"\")","v":0},{"$f":"IFERROR(VLOOKUP(B77,'Cat 1 Setup (example to overide'!$A:$F,3,FALSE),\"\")","v":0},{"$f":"IFERROR(VLOOKUP(B77,'Cat 1 Setup (example to overide'!$A:$F,6,FALSE),\"\")","v":0},{"$f":"IFERROR(E77/$E$159,\"\")","v":0},{"$f":"IFERROR(F77/D77,\"\")","v":""},{"$f":"IFERROR((J77-L77)/J77,\"\")","v":""},{"$f":"IFERROR(D77/E77,\"\")","v":""},{"$f":"IFERROR(E77/$F$3,\"\")","v":0},{"$f":"IFERROR(J77*H77,\"\")","v":""}]
["Proposed",null,{"$f":"IFERROR(IF(AND(I78>$I$160,G78>$G$160),\"Star\",IF(AND(I78>$I$160,G78<$G$160),\"Puzzle\",IF(AND(I78<$I$160,G78>$G$160),\"Plow Horse\",\"Dog\"))),\"\")","v":"Puzzle"},{"$f":"IFERROR(IF(J78=\"\",D77,E78*J78),D77)","v":0},{"$f":"IFERROR(IF(K78=\"\",E77,K78*$F$3),E77)","v":0},{"$f":"IFERROR(D78*H78,F77)","v":0},{"$f":"IFERROR(IF(E78=\"\",G77,E78/$E$160),G77)","v":0},{"$f":"IFERROR(IF(L78=\"\",H77,L78/J78),H77)","v":""},{"$f":"IFERROR((J78-L78)/J78,\"\")","v":""},{"$f":"J77","v":""},{"$f":"K77","v":0},{"$f":"L77","v":""}]
[]
["Baseline",{"$f":"'Cat 1 Setup (example to overide'!A33","v":0},{"$f":"IFERROR(IF(AND(I80>$I$159,G80>$G$159),\"Star\",IF(AND(I80>$I$159,G80<$G$159),\"Puzzle\",IF(AND(I80<$I$159,G80>$G$159),\"Plow Horse\",\"Dog\"))),\"\")","v":"Puzzle"},{"$f":"IFERROR(VLOOKUP(B80,'Cat 1 Setup (example to overide'!$A:$F,4,FALSE),\"\")","v":0},{"$f":"IFERROR(VLOOKUP(B80,'Cat 1 Setup (example to overide'!$A:$F,3,FALSE),\"\")","v":0},{"$f":"IFERROR(VLOOKUP(B80,'Cat 1 Setup (example to overide'!$A:$F,6,FALSE),\"\")","v":0},{"$f":"IFERROR(E80/$E$159,\"\")","v":0},{"$f":"IFERROR(F80/D80,\"\")","v":""},{"$f":"IFERROR((J80-L80)/J80,\"\")","v":""},{"$f":"IFERROR(D80/E80,\"\")","v":""},{"$f":"IFERROR(E80/$F$3,\"\")","v":0},{"$f":"IFERROR(J80*H80,\"\")","v":""}]
["Proposed",null,{"$f":"IFERROR(IF(AND(I81>$I$160,G81>$G$160),\"Star\",IF(AND(I81>$I$160,G81<$G$160),\"Puzzle\",IF(AND(I81<$I$160,G81>$G$160),\"Plow Horse\",\"Dog\"))),\"\")","v":"Puzzle"},{"$f":"IFERROR(IF(J81=\"\",D80,E81*J81),D80)","v":0},{"$f":"IFERROR(IF(K81=\"\",E80,K81*$F$3),E80)","v":0},{"$f":"IFERROR(D81*H81,F80)","v":0},{"$f":"IFERROR(IF(E81=\"\",G80,E81/$E$160),G80)","v":0},{"$f":"IFERROR(IF(L81=\"\",H80,L81/J81),H80)","v":""},{"$f":"IFERROR((J81-L81)/J81,\"\")","v":""},{"$f":"J80","v":""},{"$f":"K80","v":0},{"$f":"L80","v":""}]
[]
["Baseline",{"$f":"'Cat 1 Setup (example to overide'!A34","v":0},{"$f":"IFERROR(IF(AND(I83>$I$159,G83>$G$159),\"Star\",IF(AND(I83>$I$159,G83<$G$159),\"Puzzle\",IF(AND(I83<$I$159,G83>$G$159),\"Plow Horse\",\"Dog\"))),\"\")","v":"Puzzle"},{"$f":"IFERROR(VLOOKUP(B83,'Cat 1 Setup (example to overide'!$A:$F,4,FALSE),\"\")","v":0},{"$f":"IFERROR(VLOOKUP(B83,'Cat 1 Setup (example to overide'!$A:$F,3,FALSE),\"\")","v":0},{"$f":"IFERROR(VLOOKUP(B83,'Cat 1 Setup (example to overide'!$A:$F,6,FALSE),\"\")","v":0},{"$f":"IFERROR(E83/$E$159,\"\")","v":0},{"$f":"IFERROR(F83/D83,\"\")","v":""},{"$f":"IFERROR((J83-L83)/J83,\"\")","v":""},{"$f":"IFERROR(D83/E83,\"\")","v":""},{"$f":"IFERROR(E83/$F$3,\"\")","v":0},{"$f":"IFERROR(J83*H83,\"\")","v":""}]
["Proposed",null,{"$f":"IFERROR(IF(AND(I84>$I$160,G84>$G$160),\"Star\",IF(AND(I84>$I$160,G84<$G$160),\"Puzzle\",IF(AND(I84<$I$160,G84>$G$160),\"Plow Horse\",\"Dog\"))),\"\")","v":"Puzzle"},{"$f":"IFERROR(IF(J84=\"\",D83,E84*J84),D83)","v":0},{"$f":"IFERROR(IF(K84=\"\",E83,K84*$F$3),E83)","v":0},{"$f":"IFERROR(D84*H84,F83)","v":0},{"$f":"IFERROR(IF(E84=\"\",G83,E84/$E$160),G83)","v":0},{"$f":"IFERROR(IF(L84=\"\",H83,L84/J84),H83)","v":""},{"$f":"IFERROR((J84-L84)/J84,\"\")","v":""},{"$f":"J83","v":""},{"$f":"K83","v":0},{"$f":"L83","v":""}]
[]
["Baseline",{"$f":"'Cat 1 Setup (example to overide'!A35","v":0},{"$f":"IFERROR(IF(AND(I86>$I$159,G86>$G$159),\"Star\",IF(AND(I86>$I$159,G86<$G$159),\"Puzzle\",IF(AND(I86<$I$159,G86>$G$159),\"Plow Horse\",\"Dog\"))),\"\")","v":"Puzzle"},{"$f":"IFERROR(VLOOKUP(B86,'Cat 1 Setup (example to overide'!$A:$F,4,FALSE),\"\")","v":0},{"$f":"IFERROR(VLOOKUP(B86,'Cat 1 Setup (example to overide'!$A:$F,3,FALSE),\"\")","v":0},{"$f":"IFERROR(VLOOKUP(B86,'Cat 1 Setup (example to overide'!$A:$F,6,FALSE),\"\")","v":0},{"$f":"IFERROR(E86/$E$159,\"\")","v":0},{"$f":"IFERROR(F86/D86,\"\")","v":""},{"$f":"IFERROR((J86-L86)/J86,\"\")","v":""},{"$f":"IFERROR(D86/E86,\"\")","v":""},{"$f":"IFERROR(E86/$F$3,\"\")","v":0},{"$f":"IFERROR(J86*H86,\"\")","v":""}]
["Proposed",null,{"$f":"IFERROR(IF(AND(I87>$I$160,G87>$G$160),\"Star\",IF(AND(I87>$I$160,G87<$G$160),\"Puzzle\",IF(AND(I87<$I$160,G87>$G$160),\"Plow Horse\",\"Dog\"))),\"\")","v":"Puzzle"},{"$f":"IFERROR(IF(J87=\"\",D86,E87*J87),D86)","v":0},{"$f":"IFERROR(IF(K87=\"\",E86,K87*$F$3),E86)","v":0},{"$f":"IFERROR(D87*H87,F86)","v":0},{"$f":"IFERROR(IF(E87=\"\",G86,E87/$E$160),G86)","v":0},{"$f":"IFERROR(IF(L87=\"\",H86,L87/J87),H86)","v":""},{"$f":"IFERROR((J87-L87)/J87,\"\")","v":""},{"$f":"J86","v":""},{"$f":"K86","v":0},{"$f":"L86","v":""}]
[]
["Baseline",{"$f":"'Cat 1 Setup (example to overide'!A36","v":0},{"$f":"IFERROR(IF(AND(I89>$I$159,G89>$G$159),\"Star\",IF(AND(I89>$I$159,G89<$G$159),\"Puzzle\",IF(AND(I89<$I$159,G89>$G$159),\"Plow Horse\",\"Dog\"))),\"\")","v":"Puzzle"},{"$f":"IFERROR(VLOOKUP(B89,'Cat 1 Setup (example to overide'!$A:$F,4,FALSE),\"\")","v":0},{"$f":"IFERROR(VLOOKUP(B89,'Cat 1 Setup (example to overide'!$A:$F,3,FALSE),\"\")","v":0},{"$f":"IFERROR(VLOOKUP(B89,'Cat 1 Setup (example to overide'!$A:$F,6,FALSE),\"\")","v":0},{"$f":"IFERROR(E89/$E$159,\"\")","v":0},{"$f":"IFERROR(F89/D89,\"\")","v":""},{"$f":"IFERROR((J89-L89)/J89,\"\")","v":""},{"$f":"IFERROR(D89/E89,\"\")","v":""},{"$f":"IFERROR(E89/$F$3,\"\")","v":0},{"$f":"IFERROR(J89*H89,\"\")","v":""}]
["Proposed",null,{"$f":"IFERROR(IF(AND(I90>$I$160,G90>$G$160),\"Star\",IF(AND(I90>$I$160,G90<$G$160),\"Puzzle\",IF(AND(I90<$I$160,G90>$G$160),\"Plow Horse\",\"Dog\"))),\"\")","v":"Puzzle"},{"$f":"IFERROR(IF(J90=\"\",D89,E90*J90),D89)","v":0},{"$f":"IFERROR(IF(K90=\"\",E89,K90*$F$3),E89)","v":0},{"$f":"IFERROR(D90*H90,F89)","v":0},{"$f":"IFERROR(IF(E90=\"\",G89,E90/$E$160),G89)","v":0},{"$f":"IFERROR(IF(L90=\"\",H89,L90/J90),H89)","v":""},{"$f":"IFERROR((J90-L90)/J90,\"\")","v":""},{"$f":"J89","v":""},{"$f":"K89","v":0},{"$f":"L89","v":""}]
[]
["Baseline",{"$f":"'Cat 1 Setup (example to overide'!A37","v":0},{"$f":"IFERROR(IF(AND(I92>$I$159,G92>$G$159),\"Star\",IF(AND(I92>$I$159,G92<$G$159),\"Puzzle\",IF(AND(I92<$I$159,G92>$G$159),\"Plow Horse\",\"Dog\"))),\"\")","v":"Puzzle"},{"$f":"IFERROR(VLOOKUP(B92,'Cat 1 Setup (example to overide'!$A:$F,4,FALSE),\"\")","v":0},{"$f":"IFERROR(VLOOKUP(B92,'Cat 1 Setup (example to overide'!$A:$F,3,FALSE),\"\")","v":0},{"$f":"IFERROR(VLOOKUP(B92,'Cat 1 Setup (example to overide'!$A:$F,6,FALSE),\"\")","v":0},{"$f":"IFERROR(E92/$E$159,\"\")","v":0},{"$f":"IFERROR(F92/D92,\"\")","v":""},{"$f":"IFERROR((J92-L92)/J92,\"\")","v":""},{"$f":"IFERROR(D92/E92,\"\")","v":""},{"$f":"IFERROR(E92/$F$3,\"\")","v":0},{"$f":"IFERROR(J92*H92,\"\")","v":""}]
["Proposed",null,{"$f":"IFERROR(IF(AND(I93>$I$160,G93>$G$160),\"Star\",IF(AND(I93>$I$160,G93<$G$160),\"Puzzle\",IF(AND(I93<$I$160,G93>$G$160),\"Plow Horse\",\"Dog\"))),\"\")","v":"Puzzle"},{"$f":"IFERROR(IF(J93=\"\",D92,E93*J93),D92)","v":0},{"$f":"IFERROR(IF(K93=\"\",E92,K93*$F$3),E92)","v":0},{"$f":"IFERROR(D93*H93,F92)","v":0},{"$f":"IFERROR(IF(E93=\"\",G92,E93/$E$160),G92)","v":0},{"$f":"IFERROR(IF(L93=\"\",H92,L93/J93),H92)","v":""},{"$f":"IFERROR((J93-L93)/J93,\"\")","v":""},{"$f":"J92","v":""},{"$f":"K92","v":0},{"$f":"L92","v":""}]
[]
["Baseline",{"$f":"'Cat 1 Setup (example to overide'!A38","v":0},{"$f":"IFERROR(IF(AND(I95>$I$159,G95>$G$159),\"Star\",IF(AND(I95>$I$159,G95<$G$159),\"Puzzle\",IF(AND(I95<$I$159,G95>$G$159),\"Plow Horse\",\"Dog\"))),\"\")","v":"Puzzle"},{"$f":"IFERROR(VLOOKUP(B95,'Cat 1 Setup (example to overide'!$A:$F,4,FALSE),\"\")","v":0},{"$f":"IFERROR(VLOOKUP(B95,'Cat 1 Setup (example to overide'!$A:$F,3,FALSE),\"\")","v":0},{"$f":"IFERROR(VLOOKUP(B95,'Cat 1 Setup (example to overide'!$A:$F,6,FALSE),\"\")","v":0},{"$f":"IFERROR(E95/$E$159,\"\")","v":0},{"$f":"IFERROR(F95/D95,\"\")","v":""},{"$f":"IFERROR((J95-L95)/J95,\"\")","v":""},{"$f":"IFERROR(D95/E95,\"\")","v":""},{"$f":"IFERROR(E95/$F$3,\"\")","v":0},{"$f":"IFERROR(J95*H95,\"\")","v":""}]
["Proposed",null,{"$f":"IFERROR(IF(AND(I96>$I$160,G96>$G$160),\"Star\",IF(AND(I96>$I$160,G96<$G$160),\"Puzzle\",IF(AND(I96<$I$160,G96>$G$160),\"Plow Horse\",\"Dog\"))),\"\")","v":"Puzzle"},{"$f":"IFERROR(IF(J96=\"\",D95,E96*J96),D95)","v":0},{"$f":"IFERROR(IF(K96=\"\",E95,K96*$F$3),E95)","v":0},{"$f":"IFERROR(D96*H96,F95)","v":0},{"$f":"IFERROR(IF(E96=\"\",G95,E96/$E$160),G95)","v":0},{"$f":"IFERROR(IF(L96=\"\",H95,L96/J96),H95)","v":""},{"$f":"IFERROR((J96-L96)/J96,\"\")","v":""},{"$f":"J95","v":""},{"$f":"K95","v":0},{"$f":"L95","v":""}]
[]
["Baseline",{"$f":"'Cat 1 Setup (example to overide'!A39","v":0},{"$f":"IFERROR(IF(AND(I98>$I$159,G98>$G$159),\"Star\",IF(AND(I98>$I$159,G98<$G$159),\"Puzzle\",IF(AND(I98<$I$159,G98>$G$159),\"Plow Horse\",\"Dog\"))),\"\")","v":"Puzzle"},{"$f":"IFERROR(VLOOKUP(B98,'Cat 1 Setup (example to overide'!$A:$F,4,FALSE),\"\")","v":0},{"$f":"IFERROR(VLOOKUP(B98,'Cat 1 Setup (example to overide'!$A:$F,3,FALSE),\"\")","v":0},{"$f":"IFERROR(VLOOKUP(B98,'Cat 1 Setup (example to overide'!$A:$F,6,FALSE),\"\")","v":0},{"$f":"IFERROR(E98/$E$159,\"\")","v":0},{"$f":"IFERROR(F98/D98,\"\")","v":""},{"$f":"IFERROR((J98-L98)/J98,\"\")","v":""},{"$f":"IFERROR(D98/E98,\"\")","v":""},{"$f":"IFERROR(E98/$F$3,\"\")","v":0},{"$f":"IFERROR(J98*H98,\"\")","v":""}]
["Proposed",null,{"$f":"IFERROR(IF(AND(I99>$I$160,G99>$G$160),\"Star\",IF(AND(I99>$I$160,G99<$G$160),\"Puzzle\",IF(AND(I99<$I$160,G99>$G$160),\"Plow Horse\",\"Dog\"))),\"\")","v":"Puzzle"},{"$f":"IFERROR(IF(J99=\"\",D98,E99*J99),D98)","v":0},{"$f":"IFERROR(IF(K99=\"\",E98,K99*$F$3),E98)","v":0},{"$f":"IFERROR(D99*H99,F98)","v":0},{"$f":"IFERROR(IF(E99=\"\",G98,E99/$E$160),G98)","v":0},{"$f":"IFERROR(IF(L99=\"\",H98,L99/J99),H98)","v":""},{"$f":"IFERROR((J99-L99)/J99,\"\")","v":""},{"$f":"J98","v":""},{"$f":"K98","v":0},{"$f":"L98","v":""}]
[]
["Baseline",{"$f":"'Cat 1 Setup (example to overide'!A40","v":0},{"$f":"IFERROR(IF(AND(I101>$I$159,G101>$G$159),\"Star\",IF(AND(I101>$I$159,G101<$G$159),\"Puzzle\",IF(AND(I101<$I$159,G101>$G$159),\"Plow Horse\",\"Dog\"))),\"\")","v":"Puzzle"},{"$f":"IFERROR(VLOOKUP(B101,'Cat 1 Setup (example to overide'!$A:$F,4,FALSE),\"\")","v":0},{"$f":"IFERROR(VLOOKUP(B101,'Cat 1 Setup (example to overide'!$A:$F,3,FALSE),\"\")","v":0},{"$f":"IFERROR(VLOOKUP(B101,'Cat 1 Setup (example to overide'!$A:$F,6,FALSE),\"\")","v":0},{"$f":"IFERROR(E101/$E$159,\"\")","v":0},{"$f":"IFERROR(F101/D101,\"\")","v":""},{"$f":"IFERROR((J101-L101)/J101,\"\")","v":""},{"$f":"IFERROR(D101/E101,\"\")","v":""},{"$f":"IFERROR(E101/$F$3,\"\")","v":0},{"$f":"IFERROR(J101*H101,\"\")","v":""}]
["Proposed",null,{"$f":"IFERROR(IF(AND(I102>$I$160,G102>$G$160),\"Star\",IF(AND(I102>$I$160,G102<$G$160),\"Puzzle\",IF(AND(I102<$I$160,G102>$G$160),\"Plow Horse\",\"Dog\"))),\"\")","v":"Puzzle"},{"$f":"IFERROR(IF(J102=\"\",D101,E102*J102),D101)","v":0},{"$f":"IFERROR(IF(K102=\"\",E101,K102*$F$3),E101)","v":0},{"$f":"IFERROR(D102*H102,F101)","v":0},{"$f":"IFERROR(IF(E102=\"\",G101,E102/$E$160),G101)","v":0},{"$f":"IFERROR(IF(L102=\"\",H101,L102/J102),H101)","v":""},{"$f":"IFERROR((J102-L102)/J102,\"\")","v":""},{"$f":"J101","v":""},{"$f":"K101","v":0},{"$f":"L101","v":""}]
[]
["Baseline",{"$f":"'Cat 1 Setup (example to overide'!A41","v":0},{"$f":"IFERROR(IF(AND(I104>$I$159,G104>$G$159),\"Star\",IF(AND(I104>$I$159,G104<$G$159),\"Puzzle\",IF(AND(I104<$I$159,G104>$G$159),\"Plow Horse\",\"Dog\"))),\"\")","v":"Puzzle"},{"$f":"IFERROR(VLOOKUP(B104,'Cat 1 Setup (example to overide'!$A:$F,4,FALSE),\"\")","v":0},{"$f":"IFERROR(VLOOKUP(B104,'Cat 1 Setup (example to overide'!$A:$F,3,FALSE),\"\")","v":0},{"$f":"IFERROR(VLOOKUP(B104,'Cat 1 Setup (example to overide'!$A:$F,6,FALSE),\"\")","v":0},{"$f":"IFERROR(E104/$E$159,\"\")","v":0},{"$f":"IFERROR(F104/D104,\"\")","v":""},{"$f":"IFERROR((J104-L104)/J104,\"\")","v":""},{"$f":"IFERROR(D104/E104,\"\")","v":""},{"$f":"IFERROR(E104/$F$3,\"\")","v":0},{"$f":"IFERROR(J104*H104,\"\")","v":""}]
["Proposed",null,{"$f":"IFERROR(IF(AND(I105>$I$160,G105>$G$160),\"Star\",IF(AND(I105>$I$160,G105<$G$160),\"Puzzle\",IF(AND(I105<$I$160,G105>$G$160),\"Plow Horse\",\"Dog\"))),\"\")","v":"Puzzle"},{"$f":"IFERROR(IF(J105=\"\",D104,E105*J105),D104)","v":0},{"$f":"IFERROR(IF(K105=\"\",E104,K105*$F$3),E104)","v":0},{"$f":"IFERROR(D105*H105,F104)","v":0},{"$f":"IFERROR(IF(E105=\"\",G104,E105/$E$160),G104)","v":0},{"$f":"IFERROR(IF(L105=\"\",H104,L105/J105),H104)","v":""},{"$f":"IFERROR((J105-L105)/J105,\"\")","v":""},{"$f":"J104","v":""},{"$f":"K104","v":0},{"$f":"L104","v":""}]
[]
["Baseline",{"$f":"'Cat 1 Setup (example to overide'!A42","v":0},{"$f":"IFERROR(IF(AND(I107>$I$159,G107>$G$159),\"Star\",IF(AND(I107>$I$159,G107<$G$159),\"Puzzle\",IF(AND(I107<$I$159,G107>$G$159),\"Plow Horse\",\"Dog\"))),\"\")","v":"Puzzle"},{"$f":"IFERROR(VLOOKUP(B107,'Cat 1 Setup (example to overide'!$A:$F,4,FALSE),\"\")","v":0},{"$f":"IFERROR(VLOOKUP(B107,'Cat 1 Setup (example to overide'!$A:$F,3,FALSE),\"\")","v":0},{"$f":"IFERROR(VLOOKUP(B107,'Cat 1 Setup (example to overide'!$A:$F,6,FALSE),\"\")","v":0},{"$f":"IFERROR(E107/$E$159,\"\")","v":0},{"$f":"IFERROR(F107/D107,\"\")","v":""},{"$f":"IFERROR((J107-L107)/J107,\"\")","v":""},{"$f":"IFERROR(D107/E107,\"\")","v":""},{"$f":"IFERROR(E107/$F$3,\"\")","v":0},{"$f":"IFERROR(J107*H107,\"\")","v":""}]
["Proposed",null,{"$f":"IFERROR(IF(AND(I108>$I$160,G108>$G$160),\"Star\",IF(AND(I108>$I$160,G108<$G$160),\"Puzzle\",IF(AND(I108<$I$160,G108>$G$160),\"Plow Horse\",\"Dog\"))),\"\")","v":"Puzzle"},{"$f":"IFERROR(IF(J108=\"\",D107,E108*J108),D107)","v":0},{"$f":"IFERROR(IF(K108=\"\",E107,K108*$F$3),E107)","v":0},{"$f":"IFERROR(D108*H108,F107)","v":0},{"$f":"IFERROR(IF(E108=\"\",G107,E108/$E$160),G107)","v":0},{"$f":"IFERROR(IF(L108=\"\",H107,L108/J108),H107)","v":""},{"$f":"IFERROR((J108-L108)/J108,\"\")","v":""},{"$f":"J107","v":""},{"$f":"K107","v":0},{"$f":"L107","v":""}]
[]
["Baseline",{"$f":"'Cat 1 Setup (example to overide'!A43","v":0},{"$f":"IFERROR(IF(AND(I110>$I$159,G110>$G$159),\"Star\",IF(AND(I110>$I$159,G110<$G$159),\"Puzzle\",IF(AND(I110<$I$159,G110>$G$159),\"Plow Horse\",\"Dog\"))),\"\")","v":"Puzzle"},{"$f":"IFERROR(VLOOKUP(B110,'Cat 1 Setup (example to overide'!$A:$F,4,FALSE),\"\")","v":0},{"$f":"IFERROR(VLOOKUP(B110,'Cat 1 Setup (example to overide'!$A:$F,3,FALSE),\"\")","v":0},{"$f":"IFERROR(VLOOKUP(B110,'Cat 1 Setup (example to overide'!$A:$F,6,FALSE),\"\")","v":0},{"$f":"IFERROR(E110/$E$159,\"\")","v":0},{"$f":"IFERROR(F110/D110,\"\")","v":""},{"$f":"IFERROR((J110-L110)/J110,\"\")","v":""},{"$f":"IFERROR(D110/E110,\"\")","v":""},{"$f":"IFERROR(E110/$F$3,\"\")","v":0},{"$f":"IFERROR(J110*H110,\"\")","v":""}]
["Proposed",null,{"$f":"IFERROR(IF(AND(I111>$I$160,G111>$G$160),\"Star\",IF(AND(I111>$I$160,G111<$G$160),\"Puzzle\",IF(AND(I111<$I$160,G111>$G$160),\"Plow Horse\",\"Dog\"))),\"\")","v":"Puzzle"},{"$f":"IFERROR(IF(J111=\"\",D110,E111*J111),D110)","v":0},{"$f":"IFERROR(IF(K111=\"\",E110,K111*$F$3),E110)","v":0},{"$f":"IFERROR(D111*H111,F110)","v":0},{"$f":"IFERROR(IF(E111=\"\",G110,E111/$E$160),G110)","v":0},{"$f":"IFERROR(IF(L111=\"\",H110,L111/J111),H110)","v":""},{"$f":"IFERROR((J111-L111)/J111,\"\")","v":""},{"$f":"J110","v":""},{"$f":"K110","v":0},{"$f":"L110","v":""}]
[]
["Baseline",{"$f":"'Cat 1 Setup (example to overide'!A44","v":0},{"$f":"IFERROR(IF(AND(I113>$I$159,G113>$G$159),\"Star\",IF(AND(I113>$I$159,G113<$G$159),\"Puzzle\",IF(AND(I113<$I$159,G113>$G$159),\"Plow Horse\",\"Dog\"))),\"\")","v":"Puzzle"},{"$f":"IFERROR(VLOOKUP(B113,'Cat 1 Setup (example to overide'!$A:$F,4,FALSE),\"\")","v":0},{"$f":"IFERROR(VLOOKUP(B113,'Cat 1 Setup (example to overide'!$A:$F,3,FALSE),\"\")","v":0},{"$f":"IFERROR(VLOOKUP(B113,'Cat 1 Setup (example to overide'!$A:$F,6,FALSE),\"\")","v":0},{"$f":"IFERROR(E113/$E$159,\"\")","v":0},{"$f":"IFERROR(F113/D113,\"\")","v":""},{"$f":"IFERROR((J113-L113)/J113,\"\")","v":""},{"$f":"IFERROR(D113/E113,\"\")","v":""},{"$f":"IFERROR(E113/$F$3,\"\")","v":0},{"$f":"IFERROR(J113*H113,\"\")","v":""}]
["Proposed",null,{"$f":"IFERROR(IF(AND(I114>$I$160,G114>$G$160),\"Star\",IF(AND(I114>$I$160,G114<$G$160),\"Puzzle\",IF(AND(I114<$I$160,G114>$G$160),\"Plow Horse\",\"Dog\"))),\"\")","v":"Puzzle"},{"$f":"IFERROR(IF(J114=\"\",D113,E114*J114),D113)","v":0},{"$f":"IFERROR(IF(K114=\"\",E113,K114*$F$3),E113)","v":0},{"$f":"IFERROR(D114*H114,F113)","v":0},{"$f":"IFERROR(IF(E114=\"\",G113,E114/$E$160),G113)","v":0},{"$f":"IFERROR(IF(L114=\"\",H113,L114/J114),H113)","v":""},{"$f":"IFERROR((J114-L114)/J114,\"\")","v":""},{"$f":"J113","v":""},{"$f":"K113","v":0},{"$f":"L113","v":""}]
[]
["Baseline",{"$f":"'Cat 1 Setup (example to overide'!A45","v":0},{"$f":"IFERROR(IF(AND(I116>$I$159,G116>$G$159),\"Star\",IF(AND(I116>$I$159,G116<$G$159),\"Puzzle\",IF(AND(I116<$I$159,G116>$G$159),\"Plow Horse\",\"Dog\"))),\"\")","v":"Puzzle"},{"$f":"IFERROR(VLOOKUP(B116,'Cat 1 Setup (example to overide'!$A:$F,4,FALSE),\"\")","v":0},{"$f":"IFERROR(VLOOKUP(B116,'Cat 1 Setup (example to overide'!$A:$F,3,FALSE),\"\")","v":0},{"$f":"IFERROR(VLOOKUP(B116,'Cat 1 Setup (example to overide'!$A:$F,6,FALSE),\"\")","v":0},{"$f":"IFERROR(E116/$E$159,\"\")","v":0},{"$f":"IFERROR(F116/D116,\"\")","v":""},{"$f":"IFERROR((J116-L116)/J116,\"\")","v":""},{"$f":"IFERROR(D116/E116,\"\")","v":""},{"$f":"IFERROR(E116/$F$3,\"\")","v":0},{"$f":"IFERROR(J116*H116,\"\")","v":""}]
["Proposed",null,{"$f":"IFERROR(IF(AND(I117>$I$160,G117>$G$160),\"Star\",IF(AND(I117>$I$160,G117<$G$160),\"Puzzle\",IF(AND(I117<$I$160,G117>$G$160),\"Plow Horse\",\"Dog\"))),\"\")","v":"Puzzle"},{"$f":"IFERROR(IF(J117=\"\",D116,E117*J117),D116)","v":0},{"$f":"IFERROR(IF(K117=\"\",E116,K117*$F$3),E116)","v":0},{"$f":"IFERROR(D117*H117,F116)","v":0},{"$f":"IFERROR(IF(E117=\"\",G116,E117/$E$160),G116)","v":0},{"$f":"IFERROR(IF(L117=\"\",H116,L117/J117),H116)","v":""},{"$f":"IFERROR((J117-L117)/J117,\"\")","v":""},{"$f":"J116","v":""},{"$f":"K116","v":0},{"$f":"L116","v":""}]
[]
["Baseline",{"$f":"'Cat 1 Setup (example to overide'!A46","v":0},{"$f":"IFERROR(IF(AND(I119>$I$159,G119>$G$159),\"Star\",IF(AND(I119>$I$159,G119<$G$159),\"Puzzle\",IF(AND(I119<$I$159,G119>$G$159),\"Plow Horse\",\"Dog\"))),\"\")","v":"Puzzle"},{"$f":"IFERROR(VLOOKUP(B119,'Cat 1 Setup (example to overide'!$A:$F,4,FALSE),\"\")","v":0},{"$f":"IFERROR(VLOOKUP(B119,'Cat 1 Setup (example to overide'!$A:$F,3,FALSE),\"\")","v":0},{"$f":"IFERROR(VLOOKUP(B119,'Cat 1 Setup (example to overide'!$A:$F,6,FALSE),\"\")","v":0},{"$f":"IFERROR(E119/$E$159,\"\")","v":0},{"$f":"IFERROR(F119/D119,\"\")","v":""},{"$f":"IFERROR((J119-L119)/J119,\"\")","v":""},{"$f":"IFERROR(D119/E119,\"\")","v":""},{"$f":"IFERROR(E119/$F$3,\"\")","v":0},{"$f":"IFERROR(J119*H119,\"\")","v":""}]
["Proposed",null,{"$f":"IFERROR(IF(AND(I120>$I$160,G120>$G$160),\"Star\",IF(AND(I120>$I$160,G120<$G$160),\"Puzzle\",IF(AND(I120<$I$160,G120>$G$160),\"Plow Horse\",\"Dog\"))),\"\")","v":"Puzzle"},{"$f":"IFERROR(IF(J120=\"\",D119,E120*J120),D119)","v":0},{"$f":"IFERROR(IF(K120=\"\",E119,K120*$F$3),E119)","v":0},{"$f":"IFERROR(D120*H120,F119)","v":0},{"$f":"IFERROR(IF(E120=\"\",G119,E120/$E$160),G119)","v":0},{"$f":"IFERROR(IF(L120=\"\",H119,L120/J120),H119)","v":""},{"$f":"IFERROR((J120-L120)/J120,\"\")","v":""},{"$f":"J119","v":""},{"$f":"K119","v":0},{"$f":"L119","v":""}]
[]
["Baseline",{"$f":"'Cat 1 Setup (example to overide'!A47","v":0},{"$f":"IFERROR(IF(AND(I122>$I$159,G122>$G$159),\"Star\",IF(AND(I122>$I$159,G122<$G$159),\"Puzzle\",IF(AND(I122<$I$159,G122>$G$159),\"Plow Horse\",\"Dog\"))),\"\")","v":"Puzzle"},{"$f":"IFERROR(VLOOKUP(B122,'Cat 1 Setup (example to overide'!$A:$F,4,FALSE),\"\")","v":0},{"$f":"IFERROR(VLOOKUP(B122,'Cat 1 Setup (example to overide'!$A:$F,3,FALSE),\"\")","v":0},{"$f":"IFERROR(VLOOKUP(B122,'Cat 1 Setup (example to overide'!$A:$F,6,FALSE),\"\")","v":0},{"$f":"IFERROR(E122/$E$159,\"\")","v":0},{"$f":"IFERROR(F122/D122,\"\")","v":""},{"$f":"IFERROR((J122-L122)/J122,\"\")","v":""},{"$f":"IFERROR(D122/E122,\"\")","v":""},{"$f":"IFERROR(E122/$F$3,\"\")","v":0},{"$f":"IFERROR(J122*H122,\"\")","v":""}]
["Proposed",null,{"$f":"IFERROR(IF(AND(I123>$I$160,G123>$G$160),\"Star\",IF(AND(I123>$I$160,G123<$G$160),\"Puzzle\",IF(AND(I123<$I$160,G123>$G$160),\"Plow Horse\",\"Dog\"))),\"\")","v":"Puzzle"},{"$f":"IFERROR(IF(J123=\"\",D122,E123*J123),D122)","v":0},{"$f":"IFERROR(IF(K123=\"\",E122,K123*$F$3),E122)","v":0},{"$f":"IFERROR(D123*H123,F122)","v":0},{"$f":"IFERROR(IF(E123=\"\",G122,E123/$E$160),G122)","v":0},{"$f":"IFERROR(IF(L123=\"\",H122,L123/J123),H122)","v":""},"",{"$f":"J122","v":""},{"$f":"K122","v":0},{"$f":"L122","v":""}]
[]
["Baseline",{"$f":"'Cat 1 Setup (example to overide'!A48","v":0},{"$f":"IFERROR(IF(AND(I125>$I$159,G125>$G$159),\"Star\",IF(AND(I125>$I$159,G125<$G$159),\"Puzzle\",IF(AND(I125<$I$159,G125>$G$159),\"Plow Horse\",\"Dog\"))),\"\")","v":"Puzzle"},{"$f":"IFERROR(VLOOKUP(B125,'Cat 1 Setup (example to overide'!$A:$F,4,FALSE),\"\")","v":0},{"$f":"IFERROR(VLOOKUP(B125,'Cat 1 Setup (example to overide'!$A:$F,3,FALSE),\"\")","v":0},{"$f":"IFERROR(VLOOKUP(B125,'Cat 1 Setup (example to overide'!$A:$F,6,FALSE),\"\")","v":0},{"$f":"IFERROR(E125/$E$159,\"\")","v":0},{"$f":"IFERROR(F125/D125,\"\")","v":""},{"$f":"IFERROR((J125-L125)/J125,\"\")","v":""},{"$f":"IFERROR(D125/E125,\"\")","v":""},{"$f":"IFERROR(E125/$F$3,\"\")","v":0},{"$f":"IFERROR(J125*H125,\"\")","v":""}]
["Proposed",null,{"$f":"IFERROR(IF(AND(I126>$I$160,G126>$G$160),\"Star\",IF(AND(I126>$I$160,G126<$G$160),\"Puzzle\",IF(AND(I126<$I$160,G126>$G$160),\"Plow Horse\",\"Dog\"))),\"\")","v":"Puzzle"},{"$f":"IFERROR(IF(J126=\"\",D125,E126*J126),D125)","v":0},{"$f":"IFERROR(IF(K126=\"\",E125,K126*$F$3),E125)","v":0},{"$f":"IFERROR(D126*H126,F125)","v":0},{"$f":"IFERROR(IF(E126=\"\",G125,E126/$E$160),G125)","v":0},{"$f":"IFERROR(IF(L126=\"\",H125,L126/J126),H125)","v":""},"",{"$f":"J125","v":""},{"$f":"K125","v":0},{"$f":"L125","v":""}]
[]
["Baseline",{"$f":"'Cat 1 Setup (example to overide'!A49","v":0},{"$f":"IFERROR(IF(AND(I128>$I$159,G128>$G$159),\"Star\",IF(AND(I128>$I$159,G128<$G$159),\"Puzzle\",IF(AND(I128<$I$159,G128>$G$159),\"Plow Horse\",\"Dog\"))),\"\")","v":"Puzzle"},{"$f":"IFERROR(VLOOKUP(B128,'Cat 1 Setup (example to overide'!$A:$F,4,FALSE),\"\")","v":0},{"$f":"IFERROR(VLOOKUP(B128,'Cat 1 Setup (example to overide'!$A:$F,3,FALSE),\"\")","v":0},{"$f":"IFERROR(VLOOKUP(B128,'Cat 1 Setup (example to overide'!$A:$F,6,FALSE),\"\")","v":0},{"$f":"IFERROR(E128/$E$159,\"\")","v":0},{"$f":"IFERROR(F128/D128,\"\")","v":""},{"$f":"IFERROR((J128-L128)/J128,\"\")","v":""},{"$f":"IFERROR(D128/E128,\"\")","v":""},{"$f":"IFERROR(E128/$F$3,\"\")","v":0},{"$f":"IFERROR(J128*H128,\"\")","v":""}]
["Proposed",null,{"$f":"IFERROR(IF(AND(I129>$I$160,G129>$G$160),\"Star\",IF(AND(I129>$I$160,G129<$G$160),\"Puzzle\",IF(AND(I129<$I$160,G129>$G$160),\"Plow Horse\",\"Dog\"))),\"\")","v":"Puzzle"},{"$f":"IFERROR(IF(J129=\"\",D128,E129*J129),D128)","v":0},{"$f":"IFERROR(IF(K129=\"\",E128,K129*$F$3),E128)","v":0},{"$f":"IFERROR(D129*H129,F128)","v":0},{"$f":"IFERROR(IF(E129=\"\",G128,E129/$E$160),G128)","v":0},{"$f":"IFERROR(IF(L129=\"\",H128,L129/J129),H128)","v":""},"",{"$f":"J128","v":""},{"$f":"K128","v":0},{"$f":"L128","v":""}]
[]
["Baseline",{"$f":"'Cat 1 Setup (example to overide'!A50","v":0},{"$f":"IFERROR(IF(AND(I131>$I$159,G131>$G$159),\"Star\",IF(AND(I131>$I$159,G131<$G$159),\"Puzzle\",IF(AND(I131<$I$159,G131>$G$159),\"Plow Horse\",\"Dog\"))),\"\")","v":"Puzzle"},{"$f":"IFERROR(VLOOKUP(B131,'Cat 1 Setup (example to overide'!$A:$F,4,FALSE),\"\")","v":0},{"$f":"IFERROR(VLOOKUP(B131,'Cat 1 Setup (example to overide'!$A:$F,3,FALSE),\"\")","v":0},{"$f":"IFERROR(VLOOKUP(B131,'Cat 1 Setup (example to overide'!$A:$F,6,FALSE),\"\")","v":0},{"$f":"IFERROR(E131/$E$159,\"\")","v":0},{"$f":"IFERROR(F131/D131,\"\")","v":""},{"$f":"IFERROR((J131-L131)/J131,\"\")","v":""},{"$f":"IFERROR(D131/E131,\"\")","v":""},{"$f":"IFERROR(E131/$F$3,\"\")","v":0},{"$f":"IFERROR(J131*H131,\"\")","v":""}]
["Proposed",null,{"$f":"IFERROR(IF(AND(I132>$I$160,G132>$G$160),\"Star\",IF(AND(I132>$I$160,G132<$G$160),\"Puzzle\",IF(AND(I132<$I$160,G132>$G$160),\"Plow Horse\",\"Dog\"))),\"\")","v":"Puzzle"},{"$f":"IFERROR(IF(J132=\"\",D131,E132*J132),D131)","v":0},{"$f":"IFERROR(IF(K132=\"\",E131,K132*$F$3),E131)","v":0},{"$f":"IFERROR(D132*H132,F131)","v":0},{"$f":"IFERROR(IF(E132=\"\",G131,E132/$E$160),G131)","v":0},{"$f":"IFERROR(IF(L132=\"\",H131,L132/J132),H131)","v":""},"",{"$f":"J131","v":""},{"$f":"K131","v":0},{"$f":"L131","v":""}]
[]
["Baseline",{"$f":"'Cat 1 Setup (example to overide'!A51","v":0},{"$f":"IFERROR(IF(AND(I134>$I$159,G134>$G$159),\"Star\",IF(AND(I134>$I$159,G134<$G$159),\"Puzzle\",IF(AND(I134<$I$159,G134>$G$159),\"Plow Horse\",\"Dog\"))),\"\")","v":"Puzzle"},{"$f":"IFERROR(VLOOKUP(B134,'Cat 1 Setup (example to overide'!$A:$F,4,FALSE),\"\")","v":0},{"$f":"IFERROR(VLOOKUP(B134,'Cat 1 Setup (example to overide'!$A:$F,3,FALSE),\"\")","v":0},{"$f":"IFERROR(VLOOKUP(B134,'Cat 1 Setup (example to overide'!$A:$F,6,FALSE),\"\")","v":0},{"$f":"IFERROR(E134/$E$159,\"\")","v":0},{"$f":"IFERROR(F134/D134,\"\")","v":""},{"$f":"IFERROR((J134-L134)/J134,\"\")","v":""},{"$f":"IFERROR(D134/E134,\"\")","v":""},{"$f":"IFERROR(E134/$F$3,\"\")","v":0},{"$f":"IFERROR(J134*H134,\"\")","v":""}]
["Proposed",null,{"$f":"IFERROR(IF(AND(I135>$I$160,G135>$G$160),\"Star\",IF(AND(I135>$I$160,G135<$G$160),\"Puzzle\",IF(AND(I135<$I$160,G135>$G$160),\"Plow Horse\",\"Dog\"))),\"\")","v":"Puzzle"},{"$f":"IFERROR(IF(J135=\"\",D134,E135*J135),D134)","v":0},{"$f":"IFERROR(IF(K135=\"\",E134,K135*$F$3),E134)","v":0},{"$f":"IFERROR(D135*H135,F134)","v":0},{"$f":"IFERROR(IF(E135=\"\",G134,E135/$E$160),G134)","v":0},{"$f":"IFERROR(IF(L135=\"\",H134,L135/J135),H134)","v":""},"",{"$f":"J134","v":""},{"$f":"K134","v":0},{"$f":"L134","v":""}]
[]
["Baseline",{"$f":"'Cat 1 Setup (example to overide'!A52","v":0},{"$f":"IFERROR(IF(AND(I137>$I$159,G137>$G$159),\"Star\",IF(AND(I137>$I$159,G137<$G$159),\"Puzzle\",IF(AND(I137<$I$159,G137>$G$159),\"Plow Horse\",\"Dog\"))),\"\")","v":"Puzzle"},{"$f":"IFERROR(VLOOKUP(B137,'Cat 1 Setup (example to overide'!$A:$F,4,FALSE),\"\")","v":0},{"$f":"IFERROR(VLOOKUP(B137,'Cat 1 Setup (example to overide'!$A:$F,3,FALSE),\"\")","v":0},{"$f":"IFERROR(VLOOKUP(B137,'Cat 1 Setup (example to overide'!$A:$F,6,FALSE),\"\")","v":0},{"$f":"IFERROR(E137/$E$159,\"\")","v":0},{"$f":"IFERROR(F137/D137,\"\")","v":""},{"$f":"IFERROR((J137-L137)/J137,\"\")","v":""},{"$f":"IFERROR(D137/E137,\"\")","v":""},{"$f":"IFERROR(E137/$F$3,\"\")","v":0},{"$f":"IFERROR(J137*H137,\"\")","v":""}]
["Proposed",null,{"$f":"IFERROR(IF(AND(I138>$I$160,G138>$G$160),\"Star\",IF(AND(I138>$I$160,G138<$G$160),\"Puzzle\",IF(AND(I138<$I$160,G138>$G$160),\"Plow Horse\",\"Dog\"))),\"\")","v":"Puzzle"},{"$f":"IFERROR(IF(J138=\"\",D137,E138*J138),D137)","v":0},{"$f":"IFERROR(IF(K138=\"\",E137,K138*$F$3),E137)","v":0},{"$f":"IFERROR(D138*H138,F137)","v":0},{"$f":"IFERROR(IF(E138=\"\",G137,E138/$E$160),G137)","v":0},{"$f":"IFERROR(IF(L138=\"\",H137,L138/J138),H137)","v":""},"",{"$f":"J137","v":""},{"$f":"K137","v":0},{"$f":"L137","v":""}]
[]
["Baseline",{"$f":"'Cat 1 Setup (example to overide'!A53","v":0},{"$f":"IFERROR(IF(AND(I140>$I$159,G140>$G$159),\"Star\",IF(AND(I140>$I$159,G140<$G$159),\"Puzzle\",IF(AND(I140<$I$159,G140>$G$159),\"Plow Horse\",\"Dog\"))),\"\")","v":"Puzzle"},{"$f":"IFERROR(VLOOKUP(B140,'Cat 1 Setup (example to overide'!$A:$F,4,FALSE),\"\")","v":0},{"$f":"IFERROR(VLOOKUP(B140,'Cat 1 Setup (example to overide'!$A:$F,3,FALSE),\"\")","v":0},{"$f":"IFERROR(VLOOKUP(B140,'Cat 1 Setup (example to overide'!$A:$F,6,FALSE),\"\")","v":0},{"$f":"IFERROR(E140/$E$159,\"\")","v":0},{"$f":"IFERROR(F140/D140,\"\")","v":""},{"$f":"IFERROR((J140-L140)/J140,\"\")","v":""},{"$f":"IFERROR(D140/E140,\"\")","v":""},{"$f":"IFERROR(E140/$F$3,\"\")","v":0},{"$f":"IFERROR(J140*H140,\"\")","v":""}]
["Proposed",null,{"$f":"IFERROR(IF(AND(I141>$I$160,G141>$G$160),\"Star\",IF(AND(I141>$I$160,G141<$G$160),\"Puzzle\",IF(AND(I141<$I$160,G141>$G$160),\"Plow Horse\",\"Dog\"))),\"\")","v":"Puzzle"},{"$f":"IFERROR(IF(J141=\"\",D140,E141*J141),D140)","v":0},{"$f":"IFERROR(IF(K141=\"\",E140,K141*$F$3),E140)","v":0},{"$f":"IFERROR(D141*H141,F140)","v":0},{"$f":"IFERROR(IF(E141=\"\",G140,E141/$E$160),G140)","v":0},{"$f":"IFERROR(IF(L141=\"\",H140,L141/J141),H140)","v":""},"",{"$f":"J140","v":""},{"$f":"K140","v":0},{"$f":"L140","v":""}]
[]
["Baseline",{"$f":"'Cat 1 Setup (example to overide'!A54","v":0},{"$f":"IFERROR(IF(AND(I143>$I$159,G143>$G$159),\"Star\",IF(AND(I143>$I$159,G143<$G$159),\"Puzzle\",IF(AND(I143<$I$159,G143>$G$159),\"Plow Horse\",\"Dog\"))),\"\")","v":"Puzzle"},{"$f":"IFERROR(VLOOKUP(B143,'Cat 1 Setup (example to overide'!$A:$F,4,FALSE),\"\")","v":0},{"$f":"IFERROR(VLOOKUP(B143,'Cat 1 Setup (example to overide'!$A:$F,3,FALSE),\"\")","v":0},{"$f":"IFERROR(VLOOKUP(B143,'Cat 1 Setup (example to overide'!$A:$F,6,FALSE),\"\")","v":0},{"$f":"IFERROR(E143/$E$159,\"\")","v":0},{"$f":"IFERROR(F143/D143,\"\")","v":""},{"$f":"IFERROR((J143-L143)/J143,\"\")","v":""},{"$f":"IFERROR(D143/E143,\"\")","v":""},{"$f":"IFERROR(E143/$F$3,\"\")","v":0},{"$f":"IFERROR(J143*H143,\"\")","v":""}]
["Proposed",null,{"$f":"IFERROR(IF(AND(I144>$I$160,G144>$G$160),\"Star\",IF(AND(I144>$I$160,G144<$G$160),\"Puzzle\",IF(AND(I144<$I$160,G144>$G$160),\"Plow Horse\",\"Dog\"))),\"\")","v":"Puzzle"},{"$f":"IFERROR(IF(J144=\"\",D143,E144*J144),D143)","v":0},{"$f":"IFERROR(IF(K144=\"\",E143,K144*$F$3),E143)","v":0},{"$f":"IFERROR(D144*H144,F143)","v":0},{"$f":"IFERROR(IF(E144=\"\",G143,E144/$E$160),G143)","v":0},{"$f":"IFERROR(IF(L144=\"\",H143,L144/J144),H143)","v":""},"",{"$f":"J143","v":""},{"$f":"K143","v":0},{"$f":"L143","v":""}]
[]
["Baseline",{"$f":"'Cat 1 Setup (example to overide'!A55","v":0},{"$f":"IFERROR(IF(AND(I146>$I$159,G146>$G$159),\"Star\",IF(AND(I146>$I$159,G146<$G$159),\"Puzzle\",IF(AND(I146<$I$159,G146>$G$159),\"Plow Horse\",\"Dog\"))),\"\")","v":"Puzzle"},{"$f":"IFERROR(VLOOKUP(B146,'Cat 1 Setup (example to overide'!$A:$F,4,FALSE),\"\")","v":0},{"$f":"IFERROR(VLOOKUP(B146,'Cat 1 Setup (example to overide'!$A:$F,3,FALSE),\"\")","v":0},{"$f":"IFERROR(VLOOKUP(B146,'Cat 1 Setup (example to overide'!$A:$F,6,FALSE),\"\")","v":0},{"$f":"IFERROR(E146/$E$159,\"\")","v":0},{"$f":"IFERROR(F146/D146,\"\")","v":""},{"$f":"IFERROR((J146-L146)/J146,\"\")","v":""},{"$f":"IFERROR(D146/E146,\"\")","v":""},{"$f":"IFERROR(E146/$F$3,\"\")","v":0},{"$f":"IFERROR(J146*H146,\"\")","v":""}]
["Proposed",null,{"$f":"IFERROR(IF(AND(I147>$I$160,G147>$G$160),\"Star\",IF(AND(I147>$I$160,G147<$G$160),\"Puzzle\",IF(AND(I147<$I$160,G147>$G$160),\"Plow Horse\",\"Dog\"))),\"\")","v":"Puzzle"},{"$f":"IFERROR(IF(J147=\"\",D146,E147*J147),D146)","v":0},{"$f":"IFERROR(IF(K147=\"\",E146,K147*$F$3),E146)","v":0},{"$f":"IFERROR(D147*H147,F146)","v":0},{"$f":"IFERROR(IF(E147=\"\",G146,E147/$E$160),G146)","v":0},{"$f":"IFERROR(IF(L147=\"\",H146,L147/J147),H146)","v":""},"",{"$f":"J146","v":""},{"$f":"K146","v":0},{"$f":"L146","v":""}]
[]
["Baseline",{"$f":"'Cat 1 Setup (example to overide'!A56","v":0},{"$f":"IFERROR(IF(AND(I149>$I$159,G149>$G$159),\"Star\",IF(AND(I149>$I$159,G149<$G$159),\"Puzzle\",IF(AND(I149<$I$159,G149>$G$159),\"Plow Horse\",\"Dog\"))),\"\")","v":"Puzzle"},{"$f":"IFERROR(VLOOKUP(B149,'Cat 1 Setup (example to overide'!$A:$F,4,FALSE),\"\")","v":0},{"$f":"IFERROR(VLOOKUP(B149,'Cat 1 Setup (example to overide'!$A:$F,3,FALSE),\"\")","v":0},{"$f":"IFERROR(VLOOKUP(B149,'Cat 1 Setup (example to overide'!$A:$F,6,FALSE),\"\")","v":0},{"$f":"IFERROR(E149/$E$159,\"\")","v":0},{"$f":"IFERROR(F149/D149,\"\")","v":""},{"$f":"IFERROR((J149-L149)/J149,\"\")","v":""},{"$f":"IFERROR(D149/E149,\"\")","v":""},{"$f":"IFERROR(E149/$F$3,\"\")","v":0},{"$f":"IFERROR(J149*H149,\"\")","v":""}]
["Proposed",null,{"$f":"IFERROR(IF(AND(I150>$I$160,G150>$G$160),\"Star\",IF(AND(I150>$I$160,G150<$G$160),\"Puzzle\",IF(AND(I150<$I$160,G150>$G$160),\"Plow Horse\",\"Dog\"))),\"\")","v":"Puzzle"},{"$f":"IFERROR(IF(J150=\"\",D149,E150*J150),D149)","v":0},{"$f":"IFERROR(IF(K150=\"\",E149,K150*$F$3),E149)","v":0},{"$f":"IFERROR(D150*H150,F149)","v":0},{"$f":"IFERROR(IF(E150=\"\",G149,E150/$E$160),G149)","v":0},{"$f":"IFERROR(IF(L150=\"\",H149,L150/J150),H149)","v":""},"",{"$f":"J149","v":""},{"$f":"K149","v":0},{"$f":"L149","v":""}]
[]
["Baseline",{"$f":"'Cat 1 Setup (example to overide'!A57","v":0},{"$f":"IFERROR(IF(AND(I152>$I$159,G152>$G$159),\"Star\",IF(AND(I152>$I$159,G152<$G$159),\"Puzzle\",IF(AND(I152<$I$159,G152>$G$159),\"Plow Horse\",\"Dog\"))),\"\")","v":"Puzzle"},{"$f":"IFERROR(VLOOKUP(B152,'Cat 1 Setup (example to overide'!$A:$F,4,FALSE),\"\")","v":0},{"$f":"IFERROR(VLOOKUP(B152,'Cat 1 Setup (example to overide'!$A:$F,3,FALSE),\"\")","v":0},{"$f":"IFERROR(VLOOKUP(B152,'Cat 1 Setup (example to overide'!$A:$F,6,FALSE),\"\")","v":0},{"$f":"IFERROR(E152/$E$159,\"\")","v":0},{"$f":"IFERROR(F152/D152,\"\")","v":""},{"$f":"IFERROR((J152-L152)/J152,\"\")","v":""},{"$f":"IFERROR(D152/E152,\"\")","v":""},{"$f":"IFERROR(E152/$F$3,\"\")","v":0},{"$f":"IFERROR(J152*H152,\"\")","v":""}]
["Proposed",null,{"$f":"IFERROR(IF(AND(I153>$I$160,G153>$G$160),\"Star\",IF(AND(I153>$I$160,G153<$G$160),\"Puzzle\",IF(AND(I153<$I$160,G153>$G$160),\"Plow Horse\",\"Dog\"))),\"\")","v":"Puzzle"},{"$f":"IFERROR(IF(J153=\"\",D152,E153*J153),D152)","v":0},{"$f":"IFERROR(IF(K153=\"\",E152,K153*$F$3),E152)","v":0},{"$f":"IFERROR(D153*H153,F152)","v":0},{"$f":"IFERROR(IF(E153=\"\",G152,E153/$E$160),G152)","v":0},{"$f":"IFERROR(IF(L153=\"\",H152,L153/J153),H152)","v":""},"",{"$f":"J152","v":""},{"$f":"K152","v":0},{"$f":"L152","v":""}]
[]
["Baseline",{"$f":"'Cat 1 Setup (example to overide'!A58","v":0},{"$f":"IFERROR(IF(AND(I155>$I$159,G155>$G$159),\"Star\",IF(AND(I155>$I$159,G155<$G$159),\"Puzzle\",IF(AND(I155<$I$159,G155>$G$159),\"Plow Horse\",\"Dog\"))),\"\")","v":"Puzzle"},{"$f":"IFERROR(VLOOKUP(B155,'Cat 1 Setup (example to overide'!$A:$F,4,FALSE),\"\")","v":0},{"$f":"IFERROR(VLOOKUP(B155,'Cat 1 Setup (example to overide'!$A:$F,3,FALSE),\"\")","v":0},{"$f":"IFERROR(VLOOKUP(B155,'Cat 1 Setup (example to overide'!$A:$F,6,FALSE),\"\")","v":0},{"$f":"IFERROR(E155/$E$159,\"\")","v":0},{"$f":"IFERROR(F155/D155,\"\")","v":""},{"$f":"IFERROR((J155-L155)/J155,\"\")","v":""},{"$f":"IFERROR(D155/E155,\"\")","v":""},{"$f":"IFERROR(E155/$F$3,\"\")","v":0},{"$f":"IFERROR(J155*H155,\"\")","v":""}]
["Proposed",null,{"$f":"IFERROR(IF(AND(I156>$I$160,G156>$G$160),\"Star\",IF(AND(I156>$I$160,G156<$G$160),\"Puzzle\",IF(AND(I156<$I$160,G156>$G$160),\"Plow Horse\",\"Dog\"))),\"\")","v":"Puzzle"},{"$f":"IFERROR(IF(J156=\"\",D155,E156*J156),D155)","v":0},{"$f":"IFERROR(IF(K156=\"\",E155,K156*$F$3),E155)","v":0},{"$f":"IFERROR(D156*H156,F155)","v":0},{"$f":"IFERROR(IF(E156=\"\",G155,E156/$E$160),G155)","v":0},{"$f":"IFERROR(IF(L156=\"\",H155,L156/J156),H155)","v":""},"",{"$f":"J155","v":""},{"$f":"K155","v":0},{"$f":"L155","v":""}]
[]
[null,null,null,null,null,null,null,null,null,null,"(Items/Cover)"]
["Baseline","Total",null,{"$f":"IFERROR(SUMIF($A$8:$A$157,\"Baseline\",D$8:D$157),\"\")","v":269884.5},{"$f":"IFERROR(SUMIF($A$8:$A$157,\"Baseline\",E$8:E$157),\"\")","v":10653},{"$f":"IFERROR(SUMIF($A$8:$A$157,\"Baseline\",F$8:F$157),\"\")","v":100389.94},{"$f":"IFERROR((AVERAGEIFS(G$8:G$156,$A$8:$A$156,\"Baseline\",G$8:G$156,\">0\")),\"\")","v":0.05},{"$f":"IFERROR(F159/D159,\"\")","v":0.37197371468165086},{"$f":"IFERROR(AVERAGEIF($A$8:$A$156,\"Baseline\",I$8:I$156),\"\")","v":0.64724066408334391},{"$f":"IFERROR(D159/E159,\"\")","v":25.334131230639258},{"$f":"IFERROR(E159/$F$3,\"\")","v":6.3110189573459712},{"$f":"IFERROR(F159/E159,\"\")","v":9.4236309020933078}]
["Proposed",null,null,{"$f":"IFERROR(SUMIF($A$8:$A$157,\"Proposed\",D$8:D$157),\"\")","v":269884.5},{"$f":"IFERROR(SUMIF($A$8:$A$157,\"Proposed\",E$8:E$157),\"\")","v":10653},{"$f":"IFERROR(SUMIF($A$8:$A$157,\"Proposed\",F$8:F$157),\"\")","v":100389.94},{"$f":"IFERROR((AVERAGEIFS(G$8:G$156,$A$8:$A$156,\"Proposed\",G$8:G$156,\">0\")),\"\")","v":0.05},{"$f":"IFERROR(F160/D160,\"\")","v":0.37197371468165086},{"$f":"IFERROR(AVERAGEIF($A$8:$A$156,\"Proposed\",I$8:I$156),\"\")","v":0.64724066408334391},{"$f":"IFERROR(D160/E160,\"\")","v":25.334131230639258},{"$f":"IFERROR(E160/$F$3,\"\")","v":6.3110189573459712},{"$f":"IFERROR(F160/E160,\"\")","v":9.4236309020933078}]
[null,"%/BPs change",null,{"$f":"IFERROR((D160-D159)/D159,\"\")","v":0},{"$f":"IFERROR((E160-E159)/E159,\"\")","v":0},0,{"$f":"(G160-G159)*100","v":0},{"$f":"(H160-H159)*100","v":0},{"$f":"IFERROR((I160-I159)/I159,\"\")","v":0},0,0,0]
[]
[]
[null,"Assumptions/Exclusions:"]
[]
[]
[]
[]
[]
[]
[null,"Admin Use:"]
[null,"CM (min):",{"$f":"ROUND(MIN(I8:I157),0)-5","v":-5},"Demand (max):",{"$f":"MIN(G8:G157)-0.05","v":-0.05}]
[null,"CM (max):",{"$f":"ROUND(MAX(I8:I157),0)+5","v":6},"Demand (min):",{"$f":"MAX(G8:G157)+0.05","v":0.14368253074251386}]

{"sheet":"Cat 1 CM% Chart","index":6,"n_rows":46,"n_cols":7,"rows_kept":46,"cut":false,"hidden":false,"merged":[[44,3,44,4],[45,3,45,4]]}
[{"$f":"CONCATENATE('Cat 1 CM$'!C1,\" \",'Cat 1 CM$'!C5,\" \",'Cat 1 CM$'!C4,\" - \",'Cat 1 CM$'!F5)","v":"Blue Café Dining Room Dinner - Entrée"}]
["Menu Enginnering Graph by Contribution Margin Percentage"]
[]
[]
[]
[]
[]
[]
[]
[]
[]
[]
[]
[]
[]
[]
[]
[]
[]
[]
[]
[]
[]
[]
[]
[]
[]
[]
[]
[]
[]
[]
[]
[]
[]
[]
[]
[]
[]
[]
[]
[]
[]
[null,null,null,null,null,"Low","High"]
[null,null,"X-AXIS -->","Menu Mix Parameters:",null,{"$f":"IFERROR(IF('Cat 1 CM%'!D8=\"\",\"\",MIN('Cat 1 CM%'!G8:G157)*0.9),\"\")","v":0},{"$f":"IFERROR(IF('Cat 1 CM%'!D8=\"\",\"\",MAX('Cat 1 CM%'!G8:G157)*1.1),\"\")","v":0.10305078381676523}]
[null,null,"Y-AXIS -->","Contribution Margin",null,{"$f":"IFERROR(IF('Cat 1 CM%'!D8=\"\",\"\",MIN('Cat 1 CM%'!$I$8:$I$157)*0.9),\"\")","v":0.3112758620689654},{"$f":"IFERROR(IF('Cat 1 CM%'!D8=\"\",\"\",MAX('Cat 1 CM%'!$I$8:$I$157)*1.1),\"\")","v":0.95480000000000009}]

{"sheet":"Cat 2 Setup","index":7,"n_rows":60,"n_cols":16,"rows_kept":60,"cut":false,"hidden":false,"merged":[[3,14,4,15],[5,0,6,5]]}
[null,null,null,null,null,null,null,null,null,null,"Restaurant Outlet Name",null,"Check Count"]
[null,null,null,null,null,null,null,null,null,null,"Meal Period",null,"Cover Count"]
[null,null,null,null,null,null,null,null,null,null,"Revenue Center",null,"Average Check"]
[null,null,null,null,null,null,null,null,null,null,"Menu Category",null,"Currency",{"$f":"IFERROR(IF(LEFT(N9,(FIND(MID(N9,MIN(IF(ISNUMBER(1*MID(N9,ROW($1:$255),1)),ROW($1:$255))),1),N9)-1))=\"\",\"$\",LEFT(N9,(FIND(MID(N9,MIN(IF(ISNUMBER(1*MID(N9,ROW($1:$255),1)),ROW($1:$255))),1),N9)-1))),\"\")","v":""}]
[null,null,null,null,null,null,null,null,null,null,"Start Date",null,"End Date"]
[]
[]
["Item Name","Item Number","Qty Sold","Gross Sales","Avg. Item Cost","COGS $",null,null,null,null,"Item Name","Item Number","Qty Sold","Gross Sales","Avg. Item Cost","COGS $"]
[{"$f":"K9","v":0},{"$f":"L9","v":0},{"$f":"VALUE(M9)","v":0},{"$f":"IF($N$4=\"$\",N9,(VALUE(MID(N9,FIND($N$4,N9)+LEN($N$4),LEN(N9)))))","v":{"$error":"#VALUE!"}},{"$f":"IF($N$4=\"$\",O9,(VALUE(MID(O9,FIND($N$4,O9)+LEN($N$4),LEN(O9)))))","v":{"$error":"#VALUE!"}},{"$f":"IF($N$4=\"$\",P9,(VALUE(MID(P9,FIND($N$4,P9)+LEN($N$4),LEN(P9)))))","v":{"$error":"#VALUE!"}},null,null,null,1]
[0,0,0,{"$error":"#VALUE!"},{"$error":"#VALUE!"},{"$error":"#VALUE!"},null,null,null,2]
[0,0,0,{"$error":"#VALUE!"},{"$error":"#VALUE!"},{"$error":"#VALUE!"},null,null,null,3]
[0,0,0,{"$error":"#VALUE!"},{"$error":"#VALUE!"},{"$error":"#VALUE!"},null,null,null,4]
[0,0,0,{"$error":"#VALUE!"},{"$error":"#VALUE!"},{"$error":"#VALUE!"},null,null,null,5]
[0,0,0,{"$error":"#VALUE!"},{"$error":"#VALUE!"},{"$error":"#VALUE!"},null,null,null,6]
[0,0,0,{"$error":"#VALUE!"},{"$error":"#VALUE!"},{"$error":"#VALUE!"},null,null,null,7]
[0,0,0,{"$error":"#VALUE!"},{"$error":"#VALUE!"},{"$error":"#VALUE!"},null,null,null,8]
[0,0,0,{"$error":"#VALUE!"},{"$error":"#VALUE!"},{"$error":"#VALUE!"},null,null,null,9]
[0,0,0,{"$error":"#VALUE!"},{"$error":"#VALUE!"},{"$error":"#VALUE!"},null,null,null,10]
[0,0,0,{"$error":"#VALUE!"},{"$error":"#VALUE!"},{"$error":"#VALUE!"},null,null,null,11]
[0,0,0,{"$error":"#VALUE!"},{"$error":"#VALUE!"},{"$error":"#VALUE!"},null,null,null,12]
[0,0,0,{"$error":"#VALUE!"},{"$error":"#VALUE!"},{"$error":"#VALUE!"},null,null,null,13]
[0,0,0,{"$error":"#VALUE!"},{"$error":"#VALUE!"},{"$error":"#VALUE!"},null,null,null,14]
[0,0,0,{"$error":"#VALUE!"},{"$error":"#VALUE!"},{"$error":"#VALUE!"},null,null,null,15]
[0,0,0,{"$error":"#VALUE!"},{"$error":"#VALUE!"},{"$error":"#VALUE!"},null,null,null,16]
[0,0,0,{"$error":"#VALUE!"},{"$error":"#VALUE!"},{"$error":"#VALUE!"},null,null,null,17]
[0,0,0,{"$error":"#VALUE!"},{"$error":"#VALUE!"},{"$error":"#VALUE!"},null,null,null,18]
[0,0,0,{"$error":"#VALUE!"},{"$error":"#VALUE!"},{"$error":"#VALUE!"},null,null,null,19]
[0,0,0,{"$error":"#VALUE!"},{"$error":"#VALUE!"},{"$error":"#VALUE!"},null,null,null,20]
[0,0,0,{"$error":"#VALUE!"},{"$error":"#VALUE!"},{"$error":"#VALUE!"},null,null,null,21]
[0,0,0,{"$error":"#VALUE!"},{"$error":"#VALUE!"},{"$error":"#VALUE!"},null,null,null,22]
[0,0,0,{"$error":"#VALUE!"},{"$error":"#VALUE!"},{"$error":"#VALUE!"},null,null,null,23]
[0,0,0,{"$error":"#VALUE!"},{"$error":"#VALUE!"},{"$error":"#VALUE!"},null,null,null,24]
[0,0,0,{"$error":"#VALUE!"},{"$error":"#VALUE!"},{"$error":"#VALUE!"},null,null,null,25]
[0,0,0,{"$error":"#VALUE!"},{"$error":"#VALUE!"},{"$error":"#VALUE!"},null,null,null,26]
[0,0,0,{"$error":"#VALUE!"},{"$error":"#VALUE!"},{"$error":"#VALUE!"},null,null,null,27]
[0,0,0,{"$error":"#VALUE!"},{"$error":"#VALUE!"},{"$error":"#VALUE!"},null,null,null,28]
[0,0,0,{"$error":"#VALUE!"},{"$error":"#VALUE!"},{"$error":"#VALUE!"},null,null,null,29]
[0,0,0,{"$error":"#VALUE!"},{"$error":"#VALUE!"},{"$error":"#VALUE!"},null,null,null,30]
[0,0,0,{"$error":"#VALUE!"},{"$error":"#VALUE!"},{"$error":"#VALUE!"},null,null,null,31]
[0,0,0,{"$error":"#VALUE!"},{"$error":"#VALUE!"},{"$error":"#VALUE!"},null,null,null,32]
[{"$f":"K41","v":0},{"$f":"L41","v":0},{"$f":"VALUE(M41)","v":0},{"$f":"IF($N$4=\"$\",N41,(VALUE(MID(N41,FIND($N$4,N41)+LEN($N$4),LEN(N41)))))","v":{"$error":"#VALUE!"}},{"$f":"IF($N$4=\"$\",O41,(VALUE(MID(O41,FIND($N$4,O41)+LEN($N$4),LEN(O41)))))","v":{"$error":"#VALUE!"}},{"$f":"IF($N$4=\"$\",P41,(VALUE(MID(P41,FIND($N$4,P41)+LEN($N$4),LEN(P41)))))","v":{"$error":"#VALUE!"}},null,null,null,33]
[0,0,0,{"$error":"#VALUE!"},{"$error":"#VALUE!"},{"$error":"#VALUE!"},null,null,null,34]
[0,0,0,{"$error":"#VALUE!"},{"$error":"#VALUE!"},{"$error":"#VALUE!"},null,null,null,35]
[0,0,0,{"$error":"#VALUE!"},{"$error":"#VALUE!"},{"$error":"#VALUE!"},null,null,null,36]
[0,0,0,{"$error":"#VALUE!"},{"$error":"#VALUE!"},{"$error":"#VALUE!"},null,null,null,37]
[0,0,0,{"$error":"#VALUE!"},{"$error":"#VALUE!"},{"$error":"#VALUE!"},null,null,null,38]
[0,0,0,{"$error":"#VALUE!"},{"$error":"#VALUE!"},{"$error":"#VALUE!"},null,null,null,39]
[0,0,0,{"$error":"#VALUE!"},{"$error":"#VALUE!"},{"$error":"#VALUE!"},null,null,null,40]
[0,0,0,{"$error":"#VALUE!"},{"$error":"#VALUE!"},{"$error":"#VALUE!"},null,null,null,41]
[0,0,0,{"$error":"#VALUE!"},{"$error":"#VALUE!"},{"$error":"#VALUE!"},null,null,null,42]
[0,0,0,{"$error":"#VALUE!"},{"$error":"#VALUE!"},{"$error":"#VALUE!"},null,null,null,43]
[0,0,0,{"$error":"#VALUE!"},{"$error":"#VALUE!"},{"$error":"#VALUE!"},null,null,null,44]
[0,0,0,{"$error":"#VALUE!"},{"$error":"#VALUE!"},{"$error":"#VALUE!"},null,null,null,45]
[0,0,0,{"$error":"#VALUE!"},{"$error":"#VALUE!"},{"$error":"#VALUE!"},null,null,null,46]
[0,0,0,{"$error":"#VALUE!"},{"$error":"#VALUE!"},{"$error":"#VALUE!"},null,null,null,47]
[0,0,0,{"$error":"#VALUE!"},{"$error":"#VALUE!"},{"$error":"#VALUE!"},null,null,null,48]
[0,0,0,{"$error":"#VALUE!"},{"$error":"#VALUE!"},{"$error":"#VALUE!"},null,null,null,49]
[0,0,0,{"$error":"#VALUE!"},{"$error":"#VALUE!"},{"$error":"#VALUE!"},null,null,null,50]
[null,{"$f":"L59","v":0},{"$f":"VALUE(M59)","v":0},null,{"$f":"MID(O59,FIND($N$4,O59)+LEN($N$4),LEN(O59))","v":""},{"$f":"MID(P59,FIND($N$4,P59)+LEN($N$4),LEN(P59))","v":""}]
[null,null,{"$f":"SUM(C9:C59)","v":0},{"$f":"SUM(D9:D59)","v":{"$error":"#VALUE!"}},null,{"$f":"SUM(F9:F59)","v":{"$error":"#VALUE!"}}]

{"sheet":"Cat 2 CM$","index":8,"n_rows":173,"n_cols":12,"rows_kept":173,"cut":false,"hidden":false,"merged":[[172,3,172,4],[133,1,134,1],[136,1,137,1],[139,1,140,1],[142,1,143,1],[145,1,146,1],[148,1,149,1],[151,1,152,1],[154,1,155,1],[158,1,159,2],[160,1,160,2],[171,3,171,4],[130,1,131,1],[97,1,98,1],[100,1,101,1],[103,1,104,1],[106,1,107,1],[109,1,110,1],[112,1,113,1],[115,1,116,1],[118,1,119,1],[121,1,122,1],[124,1,125,1],[127,1,128,1],[94,1,95,1],[61,1,62,1],[64,1,65,1],[67,1,68,1],[70,1,71,1],[73,1,74,1],[76,1,77,1],[79,1,80,1],[82,1,83,1],[85,1,86,1],[88,1,89,1],[91,1,92,1],[58,1,59,1],[25,1,26,1],[28,1,29,1],[31,1,32,1],[34,1,35,1],[37,1,38,1],[40,1,41,1],[43,1,44,1],[46,1,47,1],[49,1,50,1],[52,1,53,1],[55,1,56,1],[22,1,23,1],[7,1,8,1],[10,1,11,1],[13,1,14,1],[16,1,17,1],[19,1,20,1]]}
[null,"Restaurant Name",{"$f":"'Cat 2 Setup'!L1","v":0}]
[null,"Start Date:",{"$f":"'Cat 2 Setup'!L5","v":"00:00:00"},null,"Check Count:",{"$f":"'Cat 2 Setup'!N1","v":0}]
[null,"End Date",{"$f":"'Cat 2 Setup'!N5","v":"00:00:00"},null,"Cover Count:",{"$f":"'Cat 2 Setup'!N2","v":0}]
[null,"Meal Period:",{"$f":"'Cat 2 Setup'!L2","v":0},null,"Average Check:",{"$f":"'Cat 2 Setup'!N3","v":0}]
[null,"Revenue Center:",{"$f":"'Cat 2 Setup'!L3","v":0},null,"Menu Category",{"$f":"'Cat 2 Setup'!L4","v":0}]
[]
[null,"Item Name","Quadrant","Item Sales","Qty Sold","Food Cost","Menu Mix %","Item Cost %","Contribution Margin $","Item Price","Item/Cover%","Item Cost"]
["Baseline",{"$f":"'Cat 2 Setup'!A9","v":0},{"$f":"IFERROR(IF(AND(I8>$I$159,G8>$G$159),\"Star\",IF(AND(I8>$I$159,G8<$G$159),\"Puzzle\",IF(AND(I8<$I$159,G8>$G$159),\"Plow Horse\",\"Dog\"))),\"\")","v":"Dog"},{"$f":"IFERROR(VLOOKUP(B8,'Cat 2 Setup'!$A:$F,4,FALSE),\"\")","v":""},{"$f":"IFERROR(VLOOKUP(B8,'Cat 2 Setup'!$A:$F,3,FALSE),\"\")","v":0},{"$f":"IFERROR(VLOOKUP(B8,'Cat 2 Setup'!$A:$F,6,FALSE),\"\")","v":""},{"$f":"IFERROR(E8/$E$159,\"\")","v":""},{"$f":"IFERROR(F8/D8,\"\")","v":""},{"$f":"IFERROR(J8-L8,\"\")","v":""},{"$f":"IFERROR(D8/E8,\"\")","v":""},{"$f":"IFERROR(E8/$F$3,\"\")","v":""},{"$f":"IFERROR(J8*H8,\"\")","v":""}]
["Proposed",null,{"$f":"IFERROR(IF(AND(I9>$I$160,G9>$G$160),\"Star\",IF(AND(I9>$I$160,G9<$G$160),\"Puzzle\",IF(AND(I9<$I$160,G9>$G$160),\"Plow Horse\",\"Dog\"))),\"\")","v":"Dog"},{"$f":"IFERROR(IF(J9=\"\",D8,E9*J9),D8)","v":""},{"$f":"IFERROR(IF(K9=\"\",E8,K9*$F$3),E8)","v":0},{"$f":"IFERROR(D9*H9,F8)","v":""},{"$f":"IFERROR(IF(E9=\"\",G8,E9/$E$160),G8)","v":""},{"$f":"IFERROR(IF(L9=\"\",H8,L9/J9),H8)","v":""},{"$f":"IFERROR(J9-L9,\"\")","v":""},{"$f":"J8","v":""},{"$f":"K8","v":""},{"$f":"L8","v":""}]
[]
["Baseline",{"$f":"'Cat 2 Setup'!A10","v":0},{"$f":"IFERROR(IF(AND(I11>$I$159,G11>$G$159),\"Star\",IF(AND(I11>$I$159,G11<$G$159),\"Puzzle\",IF(AND(I11<$I$159,G11>$G$159),\"Plow Horse\",\"Dog\"))),\"\")","v":"Dog"},{"$f":"IFERROR(VLOOKUP(B11,'Cat 2 Setup'!$A:$F,4,FALSE),\"\")","v":""},{"$f":"IFERROR(VLOOKUP(B11,'Cat 2 Setup'!$A:$F,3,FALSE),\"\")","v":0},{"$f":"IFERROR(VLOOKUP(B11,'Cat 2 Setup'!$A:$F,6,FALSE),\"\")","v":""},{"$f":"IFERROR(E11/$E$159,\"\")","v":""},{"$f":"IFERROR(F11/D11,\"\")","v":""},{"$f":"IFERROR(J11-L11,\"\")","v":""},{"$f":"IFERROR(D11/E11,\"\")","v":""},{"$f":"IFERROR(E11/$F$3,\"\")","v":""},{"$f":"IFERROR(J11*H11,\"\")","v":""}]
["Proposed",null,{"$f":"IFERROR(IF(AND(I12>$I$160,G12>$G$160),\"Star\",IF(AND(I12>$I$160,G12<$G$160),\"Puzzle\",IF(AND(I12<$I$160,G12>$G$160),\"Plow Horse\",\"Dog\"))),\"\")","v":"Dog"},{"$f":"IFERROR(IF(J12=\"\",D11,E12*J12),D11)","v":""},{"$f":"IFERROR(IF(K12=\"\",E11,K12*$F$3),E11)","v":0},{"$f":"IFERROR(D12*H12,F11)","v":""},{"$f":"IFERROR(IF(E12=\"\",G11,E12/$E$160),G11)","v":""},{"$f":"IFERROR(IF(L12=\"\",H11,L12/J12),H11)","v":""},{"$f":"IFERROR(J12-L12,\"\")","v":""},{"$f":"J11","v":""},{"$f":"K11","v":""},{"$f":"L11","v":""}]
[]
["Baseline",{"$f":"'Cat 2 Setup'!A11","v":0},{"$f":"IFERROR(IF(AND(I14>$I$159,G14>$G$159),\"Star\",IF(AND(I14>$I$159,G14<$G$159),\"Puzzle\",IF(AND(I14<$I$159,G14>$G$159),\"Plow Horse\",\"Dog\"))),\"\")","v":"Dog"},{"$f":"IFERROR(VLOOKUP(B14,'Cat 2 Setup'!$A:$F,4,FALSE),\"\")","v":""},{"$f":"IFERROR(VLOOKUP(B14,'Cat 2 Setup'!$A:$F,3,FALSE),\"\")","v":0},{"$f":"IFERROR(VLOOKUP(B14,'Cat 2 Setup'!$A:$F,6,FALSE),\"\")","v":""},{"$f":"IFERROR(E14/$E$159,\"\")","v":""},{"$f":"IFERROR(F14/D14,\"\")","v":""},{"$f":"IFERROR(J14-L14,\"\")","v":""},{"$f":"IFERROR(D14/E14,\"\")","v":""},{"$f":"IFERROR(E14/$F$3,\"\")","v":""},{"$f":"IFERROR(J14*H14,\"\")","v":""}]
["Proposed",null,{"$f":"IFERROR(IF(AND(I15>$I$160,G15>$G$160),\"Star\",IF(AND(I15>$I$160,G15<$G$160),\"Puzzle\",IF(AND(I15<$I$160,G15>$G$160),\"Plow Horse\",\"Dog\"))),\"\")","v":"Dog"},{"$f":"IFERROR(IF(J15=\"\",D14,E15*J15),D14)","v":""},{"$f":"IFERROR(IF(K15=\"\",E14,K15*$F$3),E14)","v":0},{"$f":"IFERROR(D15*H15,F14)","v":""},{"$f":"IFERROR(IF(E15=\"\",G14,E15/$E$160),G14)","v":""},{"$f":"IFERROR(IF(L15=\"\",H14,L15/J15),H14)","v":""},{"$f":"IFERROR(J15-L15,\"\")","v":""},{"$f":"J14","v":""},{"$f":"K14","v":""},{"$f":"L14","v":""}]
[]
["Baseline",{"$f":"'Cat 2 Setup'!A12","v":0},{"$f":"IFERROR(IF(AND(I17>$I$159,G17>$G$159),\"Star\",IF(AND(I17>$I$159,G17<$G$159),\"Puzzle\",IF(AND(I17<$I$159,G17>$G$159),\"Plow Horse\",\"Dog\"))),\"\")","v":"Dog"},{"$f":"IFERROR(VLOOKUP(B17,'Cat 2 Setup'!$A:$F,4,FALSE),\"\")","v":""},{"$f":"IFERROR(VLOOKUP(B17,'Cat 2 Setup'!$A:$F,3,FALSE),\"\")","v":0},{"$f":"IFERROR(VLOOKUP(B17,'Cat 2 Setup'!$A:$F,6,FALSE),\"\")","v":""},{"$f":"IFERROR(E17/$E$159,\"\")","v":""},{"$f":"IFERROR(F17/D17,\"\")","v":""},{"$f":"IFERROR(J17-L17,\"\")","v":""},{"$f":"IFERROR(D17/E17,\"\")","v":""},{"$f":"IFERROR(E17/$F$3,\"\")","v":""},{"$f":"IFERROR(J17*H17,\"\")","v":""}]
["Proposed",null,{"$f":"IFERROR(IF(AND(I18>$I$160,G18>$G$160),\"Star\",IF(AND(I18>$I$160,G18<$G$160),\"Puzzle\",IF(AND(I18<$I$160,G18>$G$160),\"Plow Horse\",\"Dog\"))),\"\")","v":"Dog"},{"$f":"IFERROR(IF(J18=\"\",D17,E18*J18),D17)","v":""},{"$f":"IFERROR(IF(K18=\"\",E17,K18*$F$3),E17)","v":0},{"$f":"IFERROR(D18*H18,F17)","v":""},{"$f":"IFERROR(IF(E18=\"\",G17,E18/$E$160),G17)","v":""},{"$f":"IFERROR(IF(L18=\"\",H17,L18/J18),H17)","v":""},{"$f":"IFERROR(J18-L18,\"\")","v":""},{"$f":"J17","v":""},{"$f":"K17","v":""},{"$f":"L17","v":""}]
[]
["Baseline",{"$f":"'Cat 2 Setup'!A13","v":0},{"$f":"IFERROR(IF(AND(I20>$I$159,G20>$G$159),\"Star\",IF(AND(I20>$I$159,G20<$G$159),\"Puzzle\",IF(AND(I20<$I$159,G20>$G$159),\"Plow Horse\",\"Dog\"))),\"\")","v":"Dog"},{"$f":"IFERROR(VLOOKUP(B20,'Cat 2 Setup'!$A:$F,4,FALSE),\"\")","v":""},{"$f":"IFERROR(VLOOKUP(B20,'Cat 2 Setup'!$A:$F,3,FALSE),\"\")","v":0},{"$f":"IFERROR(VLOOKUP(B20,'Cat 2 Setup'!$A:$F,6,FALSE),\"\")","v":""},{"$f":"IFERROR(E20/$E$159,\"\")","v":""},{"$f":"IFERROR(F20/D20,\"\")","v":""},{"$f":"IFERROR(J20-L20,\"\")","v":""},{"$f":"IFERROR(D20/E20,\"\")","v":""},{"$f":"IFERROR(E20/$F$3,\"\")","v":""},{"$f":"IFERROR(J20*H20,\"\")","v":""}]
["Proposed",null,{"$f":"IFERROR(IF(AND(I21>$I$160,G21>$G$160),\"Star\",IF(AND(I21>$I$160,G21<$G$160),\"Puzzle\",IF(AND(I21<$I$160,G21>$G$160),\"Plow Horse\",\"Dog\"))),\"\")","v":"Dog"},{"$f":"IFERROR(IF(J21=\"\",D20,E21*J21),D20)","v":""},{"$f":"IFERROR(IF(K21=\"\",E20,K21*$F$3),E20)","v":0},{"$f":"IFERROR(D21*H21,F20)","v":""},{"$f":"IFERROR(IF(E21=\"\",G20,E21/$E$160),G20)","v":""},{"$f":"IFERROR(IF(L21=\"\",H20,L21/J21),H20)","v":""},{"$f":"IFERROR(J21-L21,\"\")","v":""},{"$f":"J20","v":""},{"$f":"K20","v":""},{"$f":"L20","v":""}]
[]
["Baseline",{"$f":"'Cat 2 Setup'!A14","v":0},{"$f":"IFERROR(IF(AND(I23>$I$159,G23>$G$159),\"Star\",IF(AND(I23>$I$159,G23<$G$159),\"Puzzle\",IF(AND(I23<$I$159,G23>$G$159),\"Plow Horse\",\"Dog\"))),\"\")","v":"Dog"},{"$f":"IFERROR(VLOOKUP(B23,'Cat 2 Setup'!$A:$F,4,FALSE),\"\")","v":""},{"$f":"IFERROR(VLOOKUP(B23,'Cat 2 Setup'!$A:$F,3,FALSE),\"\")","v":0},{"$f":"IFERROR(VLOOKUP(B23,'Cat 2 Setup'!$A:$F,6,FALSE),\"\")","v":""},{"$f":"IFERROR(E23/$E$159,\"\")","v":""},{"$f":"IFERROR(F23/D23,\"\")","v":""},{"$f":"IFERROR(J23-L23,\"\")","v":""},{"$f":"IFERROR(D23/E23,\"\")","v":""},{"$f":"IFERROR(E23/$F$3,\"\")","v":""},{"$f":"IFERROR(J23*H23,\"\")","v":""}]
["Proposed",null,{"$f":"IFERROR(IF(AND(I24>$I$160,G24>$G$160),\"Star\",IF(AND(I24>$I$160,G24<$G$160),\"Puzzle\",IF(AND(I24<$I$160,G24>$G$160),\"Plow Horse\",\"Dog\"))),\"\")","v":"Dog"},{"$f":"IFERROR(IF(J24=\"\",D23,E24*J24),D23)","v":""},{"$f":"IFERROR(IF(K24=\"\",E23,K24*$F$3),E23)","v":0},{"$f":"IFERROR(D24*H24,F23)","v":""},{"$f":"IFERROR(IF(E24=\"\",G23,E24/$E$160),G23)","v":""},{"$f":"IFERROR(IF(L24=\"\",H23,L24/J24),H23)","v":""},{"$f":"IFERROR(J24-L24,\"\")","v":""},{"$f":"J23","v":""},{"$f":"K23","v":""},{"$f":"L23","v":""}]
[]
["Baseline",{"$f":"'Cat 2 Setup'!A15","v":0},{"$f":"IFERROR(IF(AND(I26>$I$159,G26>$G$159),\"Star\",IF(AND(I26>$I$159,G26<$G$159),\"Puzzle\",IF(AND(I26<$I$159,G26>$G$159),\"Plow Horse\",\"Dog\"))),\"\")","v":"Dog"},{"$f":"IFERROR(VLOOKUP(B26,'Cat 2 Setup'!$A:$F,4,FALSE),\"\")","v":""},{"$f":"IFERROR(VLOOKUP(B26,'Cat 2 Setup'!$A:$F,3,FALSE),\"\")","v":0},{"$f":"IFERROR(VLOOKUP(B26,'Cat 2 Setup'!$A:$F,6,FALSE),\"\")","v":""},{"$f":"IFERROR(E26/$E$159,\"\")","v":""},{"$f":"IFERROR(F26/D26,\"\")","v":""},{"$f":"IFERROR(J26-L26,\"\")","v":""},{"$f":"IFERROR(D26/E26,\"\")","v":""},{"$f":"IFERROR(E26/$F$3,\"\")","v":""},{"$f":"IFERROR(J26*H26,\"\")","v":""}]
["Proposed",null,{"$f":"IFERROR(IF(AND(I27>$I$160,G27>$G$160),\"Star\",IF(AND(I27>$I$160,G27<$G$160),\"Puzzle\",IF(AND(I27<$I$160,G27>$G$160),\"Plow Horse\",\"Dog\"))),\"\")","v":"Dog"},{"$f":"IFERROR(IF(J27=\"\",D26,E27*J27),D26)","v":""},{"$f":"IFERROR(IF(K27=\"\",E26,K27*$F$3),E26)","v":0},{"$f":"IFERROR(D27*H27,F26)","v":""},{"$f":"IFERROR(IF(E27=\"\",G26,E27/$E$160),G26)","v":""},{"$f":"IFERROR(IF(L27=\"\",H26,L27/J27),H26)","v":""},{"$f":"IFERROR(J27-L27,\"\")","v":""},{"$f":"J26","v":""},{"$f":"K26","v":""},{"$f":"L26","v":""}]
[]
["Baseline",{"$f":"'Cat 2 Setup'!A16","v":0},{"$f":"IFERROR(IF(AND(I29>$I$159,G29>$G$159),\"Star\",IF(AND(I29>$I$159,G29<$G$159),\"Puzzle\",IF(AND(I29<$I$159,G29>$G$159),\"Plow Horse\",\"Dog\"))),\"\")","v":"Dog"},{"$f":"IFERROR(VLOOKUP(B29,'Cat 2 Setup'!$A:$F,4,FALSE),\"\")","v":""},{"$f":"IFERROR(VLOOKUP(B29,'Cat 2 Setup'!$A:$F,3,FALSE),\"\")","v":0},{"$f":"IFERROR(VLOOKUP(B29,'Cat 2 Setup'!$A:$F,6,FALSE),\"\")","v":""},{"$f":"IFERROR(E29/$E$159,\"\")","v":""},{"$f":"IFERROR(F29/D29,\"\")","v":""},{"$f":"IFERROR(J29-L29,\"\")","v":""},{"$f":"IFERROR(D29/E29,\"\")","v":""},{"$f":"IFERROR(E29/$F$3,\"\")","v":""},{"$f":"IFERROR(J29*H29,\"\")","v":""}]
["Proposed",null,{"$f":"IFERROR(IF(AND(I30>$I$160,G30>$G$160),\"Star\",IF(AND(I30>$I$160,G30<$G$160),\"Puzzle\",IF(AND(I30<$I$160,G30>$G$160),\"Plow Horse\",\"Dog\"))),\"\")","v":"Dog"},{"$f":"IFERROR(IF(J30=\"\",D29,E30*J30),D29)","v":""},{"$f":"IFERROR(IF(K30=\"\",E29,K30*$F$3),E29)","v":0},{"$f":"IFERROR(D30*H30,F29)","v":""},{"$f":"IFERROR(IF(E30=\"\",G29,E30/$E$160),G29)","v":""},{"$f":"IFERROR(IF(L30=\"\",H29,L30/J30),H29)","v":""},{"$f":"IFERROR(J30-L30,\"\")","v":""},{"$f":"J29","v":""},{"$f":"K29","v":""},{"$f":"L29","v":""}]
[]
["Baseline",{"$f":"'Cat 2 Setup'!A17","v":0},{"$f":"IFERROR(IF(AND(I32>$I$159,G32>$G$159),\"Star\",IF(AND(I32>$I$159,G32<$G$159),\"Puzzle\",IF(AND(I32<$I$159,G32>$G$159),\"Plow Horse\",\"Dog\"))),\"\")","v":"Dog"},{"$f":"IFERROR(VLOOKUP(B32,'Cat 2 Setup'!$A:$F,4,FALSE),\"\")","v":""},{"$f":"IFERROR(VLOOKUP(B32,'Cat 2 Setup'!$A:$F,3,FALSE),\"\")","v":0},{"$f":"IFERROR(VLOOKUP(B32,'Cat 2 Setup'!$A:$F,6,FALSE),\"\")","v":""},{"$f":"IFERROR(E32/$E$159,\"\")","v":""},{"$f":"IFERROR(F32/D32,\"\")","v":""},{"$f":"IFERROR(J32-L32,\"\")","v":""},{"$f":"IFERROR(D32/E32,\"\")","v":""},{"$f":"IFERROR(E32/$F$3,\"\")","v":""},{"$f":"IFERROR(J32*H32,\"\")","v":""}]
["Proposed",null,{"$f":"IFERROR(IF(AND(I33>$I$160,G33>$G$160),\"Star\",IF(AND(I33>$I$160,G33<$G$160),\"Puzzle\",IF(AND(I33<$I$160,G33>$G$160),\"Plow Horse\",\"Dog\"))),\"\")","v":"Dog"},{"$f":"IFERROR(IF(J33=\"\",D32,E33*J33),D32)","v":""},{"$f":"IFERROR(IF(K33=\"\",E32,K33*$F$3),E32)","v":0},{"$f":"IFERROR(D33*H33,F32)","v":""},{"$f":"IFERROR(IF(E33=\"\",G32,E33/$E$160),G32)","v":""},{"$f":"IFERROR(IF(L33=\"\",H32,L33/J33),H32)","v":""},{"$f":"IFERROR(J33-L33,\"\")","v":""},{"$f":"J32","v":""},{"$f":"K32","v":""},{"$f":"L32","v":""}]
[]
["Baseline",{"$f":"'Cat 2 Setup'!A18","v":0},{"$f":"IFERROR(IF(AND(I35>$I$159,G35>$G$159),\"Star\",IF(AND(I35>$I$159,G35<$G$159),\"Puzzle\",IF(AND(I35<$I$159,G35>$G$159),\"Plow Horse\",\"Dog\"))),\"\")","v":"Dog"},{"$f":"IFERROR(VLOOKUP(B35,'Cat 2 Setup'!$A:$F,4,FALSE),\"\")","v":""},{"$f":"IFERROR(VLOOKUP(B35,'Cat 2 Setup'!$A:$F,3,FALSE),\"\")","v":0},{"$f":"IFERROR(VLOOKUP(B35,'Cat 2 Setup'!$A:$F,6,FALSE),\"\")","v":""},{"$f":"IFERROR(E35/$E$159,\"\")","v":""},{"$f":"IFERROR(F35/D35,\"\")","v":""},{"$f":"IFERROR(J35-L35,\"\")","v":""},{"$f":"IFERROR(D35/E35,\"\")","v":""},{"$f":"IFERROR(E35/$F$3,\"\")","v":""},{"$f":"IFERROR(J35*H35,\"\")","v":""}]
["Proposed",null,{"$f":"IFERROR(IF(AND(I36>$I$160,G36>$G$160),\"Star\",IF(AND(I36>$I$160,G36<$G$160),\"Puzzle\",IF(AND(I36<$I$160,G36>$G$160),\"Plow Horse\",\"Dog\"))),\"\")","v":"Dog"},{"$f":"IFERROR(IF(J36=\"\",D35,E36*J36),D35)","v":""},{"$f":"IFERROR(IF(K36=\"\",E35,K36*$F$3),E35)","v":0},{"$f":"IFERROR(D36*H36,F35)","v":""},{"$f":"IFERROR(IF(E36=\"\",G35,E36/$E$160),G35)","v":""},{"$f":"IFERROR(IF(L36=\"\",H35,L36/J36),H35)","v":""},{"$f":"IFERROR(J36-L36,\"\")","v":""},{"$f":"J35","v":""},{"$f":"K35","v":""},{"$f":"L35","v":""}]
[]
["Baseline",{"$f":"'Cat 2 Setup'!A19","v":0},{"$f":"IFERROR(IF(AND(I38>$I$159,G38>$G$159),\"Star\",IF(AND(I38>$I$159,G38<$G$159),\"Puzzle\",IF(AND(I38<$I$159,G38>$G$159),\"Plow Horse\",\"Dog\"))),\"\")","v":"Dog"},{"$f":"IFERROR(VLOOKUP(B38,'Cat 2 Setup'!$A:$F,4,FALSE),\"\")","v":""},{"$f":"IFERROR(VLOOKUP(B38,'Cat 2 Setup'!$A:$F,3,FALSE),\"\")","v":0},{"$f":"IFERROR(VLOOKUP(B38,'Cat 2 Setup'!$A:$F,6,FALSE),\"\")","v":""},{"$f":"IFERROR(E38/$E$159,\"\")","v":""},{"$f":"IFERROR(F38/D38,\"\")","v":""},{"$f":"IFERROR(J38-L38,\"\")","v":""},{"$f":"IFERROR(D38/E38,\"\")","v":""},{"$f":"IFERROR(E38/$F$3,\"\")","v":""},{"$f":"IFERROR(J38*H38,\"\")","v":""}]
["Proposed",null,{"$f":"IFERROR(IF(AND(I39>$I$160,G39>$G$160),\"Star\",IF(AND(I39>$I$160,G39<$G$160),\"Puzzle\",IF(AND(I39<$I$160,G39>$G$160),\"Plow Horse\",\"Dog\"))),\"\")","v":"Dog"},{"$f":"IFERROR(IF(J39=\"\",D38,E39*J39),D38)","v":""},{"$f":"IFERROR(IF(K39=\"\",E38,K39*$F$3),E38)","v":0},{"$f":"IFERROR(D39*H39,F38)","v":""},{"$f":"IFERROR(IF(E39=\"\",G38,E39/$E$160),G38)","v":""},{"$f":"IFERROR(IF(L39=\"\",H38,L39/J39),H38)","v":""},{"$f":"IFERROR(J39-L39,\"\")","v":""},{"$f":"J38","v":""},{"$f":"K38","v":""},{"$f":"L38","v":""}]
[]
["Baseline",{"$f":"'Cat 2 Setup'!A20","v":0},{"$f":"IFERROR(IF(AND(I41>$I$159,G41>$G$159),\"Star\",IF(AND(I41>$I$159,G41<$G$159),\"Puzzle\",IF(AND(I41<$I$159,G41>$G$159),\"Plow Horse\",\"Dog\"))),\"\")","v":"Dog"},{"$f":"IFERROR(VLOOKUP(B41,'Cat 2 Setup'!$A:$F,4,FALSE),\"\")","v":""},{"$f":"IFERROR(VLOOKUP(B41,'Cat 2 Setup'!$A:$F,3,FALSE),\"\")","v":0},{"$f":"IFERROR(VLOOKUP(B41,'Cat 2 Setup'!$A:$F,6,FALSE),\"\")","v":""},{"$f":"IFERROR(E41/$E$159,\"\")","v":""},{"$f":"IFERROR(F41/D41,\"\")","v":""},{"$f":"IFERROR(J41-L41,\"\")","v":""},{"$f":"IFERROR(D41/E41,\"\")","v":""},{"$f":"IFERROR(E41/$F$3,\"\")","v":""},{"$f":"IFERROR(J41*H41,\"\")","v":""}]
["Proposed",null,{"$f":"IFERROR(IF(AND(I42>$I$160,G42>$G$160),\"Star\",IF(AND(I42>$I$160,G42<$G$160),\"Puzzle\",IF(AND(I42<$I$160,G42>$G$160),\"Plow Horse\",\"Dog\"))),\"\")","v":"Dog"},{"$f":"IFERROR(IF(J42=\"\",D41,E42*J42),D41)","v":""},{"$f":"IFERROR(IF(K42=\"\",E41,K42*$F$3),E41)","v":0},{"$f":"IFERROR(D42*H42,F41)","v":""},{"$f":"IFERROR(IF(E42=\"\",G41,E42/$E$160),G41)","v":""},{"$f":"IFERROR(IF(L42=\"\",H41,L42/J42),H41)","v":""},{"$f":"IFERROR(J42-L42,\"\")","v":""},{"$f":"J41","v":""},{"$f":"K41","v":""},{"$f":"L41","v":""}]
[]
["Baseline",{"$f":"'Cat 2 Setup'!A21","v":0},{"$f":"IFERROR(IF(AND(I44>$I$159,G44>$G$159),\"Star\",IF(AND(I44>$I$159,G44<$G$159),\"Puzzle\",IF(AND(I44<$I$159,G44>$G$159),\"Plow Horse\",\"Dog\"))),\"\")","v":"Dog"},{"$f":"IFERROR(VLOOKUP(B44,'Cat 2 Setup'!$A:$F,4,FALSE),\"\")","v":""},{"$f":"IFERROR(VLOOKUP(B44,'Cat 2 Setup'!$A:$F,3,FALSE),\"\")","v":0},{"$f":"IFERROR(VLOOKUP(B44,'Cat 2 Setup'!$A:$F,6,FALSE),\"\")","v":""},{"$f":"IFERROR(E44/$E$159,\"\")","v":""},{"$f":"IFERROR(F44/D44,\"\")","v":""},{"$f":"IFERROR(J44-L44,\"\")","v":""},{"$f":"IFERROR(D44/E44,\"\")","v":""},{"$f":"IFERROR(E44/$F$3,\"\")","v":""},{"$f":"IFERROR(J44*H44,\"\")","v":""}]
["Proposed",null,{"$f":"IFERROR(IF(AND(I45>$I$160,G45>$G$160),\"Star\",IF(AND(I45>$I$160,G45<$G$160),\"Puzzle\",IF(AND(I45<$I$160,G45>$G$160),\"Plow Horse\",\"Dog\"))),\"\")","v":"Dog"},{"$f":"IFERROR(IF(J45=\"\",D44,E45*J45),D44)","v":""},{"$f":"IFERROR(IF(K45=\"\",E44,K45*$F$3),E44)","v":0},{"$f":"IFERROR(D45*H45,F44)","v":""},{"$f":"IFERROR(IF(E45=\"\",G44,E45/$E$160),G44)","v":""},{"$f":"IFERROR(IF(L45=\"\",H44,L45/J45),H44)","v":""},{"$f":"IFERROR(J45-L45,\"\")","v":""},{"$f":"J44","v":""},{"$f":"K44","v":""},{"$f":"L44","v":""}]
[]
["Baseline",{"$f":"'Cat 2 Setup'!A22","v":0},{"$f":"IFERROR(IF(AND(I47>$I$159,G47>$G$159),\"Star\",IF(AND(I47>$I$159,G47<$G$159),\"Puzzle\",IF(AND(I47<$I$159,G47>$G$159),\"Plow Horse\",\"Dog\"))),\"\")","v":"Dog"},{"$f":"IFERROR(VLOOKUP(B47,'Cat 2 Setup'!$A:$F,4,FALSE),\"\")","v":""},{"$f":"IFERROR(VLOOKUP(B47,'Cat 2 Setup'!$A:$F,3,FALSE),\"\")","v":0},{"$f":"IFERROR(VLOOKUP(B47,'Cat 2 Setup'!$A:$F,6,FALSE),\"\")","v":""},{"$f":"IFERROR(E47/$E$159,\"\")","v":""},{"$f":"IFERROR(F47/D47,\"\")","v":""},{"$f":"IFERROR(J47-L47,\"\")","v":""},{"$f":"IFERROR(D47/E47,\"\")","v":""},{"$f":"IFERROR(E47/$F$3,\"\")","v":""},{"$f":"IFERROR(J47*H47,\"\")","v":""}]
["Proposed",null,{"$f":"IFERROR(IF(AND(I48>$I$160,G48>$G$160),\"Star\",IF(AND(I48>$I$160,G48<$G$160),\"Puzzle\",IF(AND(I48<$I$160,G48>$G$160),\"Plow Horse\",\"Dog\"))),\"\")","v":"Dog"},{"$f":"IFERROR(IF(J48=\"\",D47,E48*J48),D47)","v":""},{"$f":"IFERROR(IF(K48=\"\",E47,K48*$F$3),E47)","v":0},{"$f":"IFERROR(D48*H48,F47)","v":""},{"$f":"IFERROR(IF(E48=\"\",G47,E48/$E$160),G47)","v":""},{"$f":"IFERROR(IF(L48=\"\",H47,L48/J48),H47)","v":""},{"$f":"IFERROR(J48-L48,\"\")","v":""},{"$f":"J47","v":""},{"$f":"K47","v":""},{"$f":"L47","v":""}]
[]
["Baseline",{"$f":"'Cat 2 Setup'!A23","v":0},{"$f":"IFERROR(IF(AND(I50>$I$159,G50>$G$159),\"Star\",IF(AND(I50>$I$159,G50<$G$159),\"Puzzle\",IF(AND(I50<$I$159,G50>$G$159),\"Plow Horse\",\"Dog\"))),\"\")","v":"Dog"},{"$f":"IFERROR(VLOOKUP(B50,'Cat 2 Setup'!$A:$F,4,FALSE),\"\")","v":""},{"$f":"IFERROR(VLOOKUP(B50,'Cat 2 Setup'!$A:$F,3,FALSE),\"\")","v":0},{"$f":"IFERROR(VLOOKUP(B50,'Cat 2 Setup'!$A:$F,6,FALSE),\"\")","v":""},{"$f":"IFERROR(E50/$E$159,\"\")","v":""},{"$f":"IFERROR(F50/D50,\"\")","v":""},{"$f":"IFERROR(J50-L50,\"\")","v":""},{"$f":"IFERROR(D50/E50,\"\")","v":""},{"$f":"IFERROR(E50/$F$3,\"\")","v":""},{"$f":"IFERROR(J50*H50,\"\")","v":""}]
["Proposed",null,{"$f":"IFERROR(IF(AND(I51>$I$160,G51>$G$160),\"Star\",IF(AND(I51>$I$160,G51<$G$160),\"Puzzle\",IF(AND(I51<$I$160,G51>$G$160),\"Plow Horse\",\"Dog\"))),\"\")","v":"Dog"},{"$f":"IFERROR(IF(J51=\"\",D50,E51*J51),D50)","v":""},{"$f":"IFERROR(IF(K51=\"\",E50,K51*$F$3),E50)","v":0},{"$f":"IFERROR(D51*H51,F50)","v":""},{"$f":"IFERROR(IF(E51=\"\",G50,E51/$E$160),G50)","v":""},{"$f":"IFERROR(IF(L51=\"\",H50,L51/J51),H50)","v":""},{"$f":"IFERROR(J51-L51,\"\")","v":""},{"$f":"J50","v":""},{"$f":"K50","v":""},{"$f":"L50","v":""}]
[]
["Baseline",{"$f":"'Cat 2 Setup'!A24","v":0},{"$f":"IFERROR(IF(AND(I53>$I$159,G53>$G$159),\"Star\",IF(AND(I53>$I$159,G53<$G$159),\"Puzzle\",IF(AND(I53<$I$159,G53>$G$159),\"Plow Horse\",\"Dog\"))),\"\")","v":"Dog"},{"$f":"IFERROR(VLOOKUP(B53,'Cat 2 Setup'!$A:$F,4,FALSE),\"\")","v":""},{"$f":"IFERROR(VLOOKUP(B53,'Cat 2 Setup'!$A:$F,3,FALSE),\"\")","v":0},{"$f":"IFERROR(VLOOKUP(B53,'Cat 2 Setup'!$A:$F,6,FALSE),\"\")","v":""},{"$f":"IFERROR(E53/$E$159,\"\")","v":""},{"$f":"IFERROR(F53/D53,\"\")","v":""},{"$f":"IFERROR(J53-L53,\"\")","v":""},{"$f":"IFERROR(D53/E53,\"\")","v":""},{"$f":"IFERROR(E53/$F$3,\"\")","v":""},{"$f":"IFERROR(J53*H53,\"\")","v":""}]
["Proposed",null,{"$f":"IFERROR(IF(AND(I54>$I$160,G54>$G$160),\"Star\",IF(AND(I54>$I$160,G54<$G$160),\"Puzzle\",IF(AND(I54<$I$160,G54>$G$160),\"Plow Horse\",\"Dog\"))),\"\")","v":"Dog"},{"$f":"IFERROR(IF(J54=\"\",D53,E54*J54),D53)","v":""},{"$f":"IFERROR(IF(K54=\"\",E53,K54*$F$3),E53)","v":0},{"$f":"IFERROR(D54*H54,F53)","v":""},{"$f":"IFERROR(IF(E54=\"\",G53,E54/$E$160),G53)","v":""},{"$f":"IFERROR(IF(L54=\"\",H53,L54/J54),H53)","v":""},{"$f":"IFERROR(J54-L54,\"\")","v":""},{"$f":"J53","v":""},{"$f":"K53","v":""},{"$f":"L53","v":""}]
[]
["Baseline",{"$f":"'Cat 2 Setup'!A25","v":0},{"$f":"IFERROR(IF(AND(I56>$I$159,G56>$G$159),\"Star\",IF(AND(I56>$I$159,G56<$G$159),\"Puzzle\",IF(AND(I56<$I$159,G56>$G$159),\"Plow Horse\",\"Dog\"))),\"\")","v":"Dog"},{"$f":"IFERROR(VLOOKUP(B56,'Cat 2 Setup'!$A:$F,4,FALSE),\"\")","v":""},{"$f":"IFERROR(VLOOKUP(B56,'Cat 2 Setup'!$A:$F,3,FALSE),\"\")","v":0},{"$f":"IFERROR(VLOOKUP(B56,'Cat 2 Setup'!$A:$F,6,FALSE),\"\")","v":""},{"$f":"IFERROR(E56/$E$159,\"\")","v":""},{"$f":"IFERROR(F56/D56,\"\")","v":""},{"$f":"IFERROR(J56-L56,\"\")","v":""},{"$f":"IFERROR(D56/E56,\"\")","v":""},{"$f":"IFERROR(E56/$F$3,\"\")","v":""},{"$f":"IFERROR(J56*H56,\"\")","v":""}]
["Proposed",null,{"$f":"IFERROR(IF(AND(I57>$I$160,G57>$G$160),\"Star\",IF(AND(I57>$I$160,G57<$G$160),\"Puzzle\",IF(AND(I57<$I$160,G57>$G$160),\"Plow Horse\",\"Dog\"))),\"\")","v":"Dog"},{"$f":"IFERROR(IF(J57=\"\",D56,E57*J57),D56)","v":""},{"$f":"IFERROR(IF(K57=\"\",E56,K57*$F$3),E56)","v":0},{"$f":"IFERROR(D57*H57,F56)","v":""},{"$f":"IFERROR(IF(E57=\"\",G56,E57/$E$160),G56)","v":""},{"$f":"IFERROR(IF(L57=\"\",H56,L57/J57),H56)","v":""},{"$f":"IFERROR(J57-L57,\"\")","v":""},{"$f":"J56","v":""},{"$f":"K56","v":""},{"$f":"L56","v":""}]
[]
["Baseline",{"$f":"'Cat 2 Setup'!A26","v":0},{"$f":"IFERROR(IF(AND(I59>$I$159,G59>$G$159),\"Star\",IF(AND(I59>$I$159,G59<$G$159),\"Puzzle\",IF(AND(I59<$I$159,G59>$G$159),\"Plow Horse\",\"Dog\"))),\"\")","v":"Dog"},{"$f":"IFERROR(VLOOKUP(B59,'Cat 2 Setup'!$A:$F,4,FALSE),\"\")","v":""},{"$f":"IFERROR(VLOOKUP(B59,'Cat 2 Setup'!$A:$F,3,FALSE),\"\")","v":0},{"$f":"IFERROR(VLOOKUP(B59,'Cat 2 Setup'!$A:$F,6,FALSE),\"\")","v":""},{"$f":"IFERROR(E59/$E$159,\"\")","v":""},{"$f":"IFERROR(F59/D59,\"\")","v":""},{"$f":"IFERROR(J59-L59,\"\")","v":""},{"$f":"IFERROR(D59/E59,\"\")","v":""},{"$f":"IFERROR(E59/$F$3,\"\")","v":""},{"$f":"IFERROR(J59*H59,\"\")","v":""}]
["Proposed",null,{"$f":"IFERROR(IF(AND(I60>$I$160,G60>$G$160),\"Star\",IF(AND(I60>$I$160,G60<$G$160),\"Puzzle\",IF(AND(I60<$I$160,G60>$G$160),\"Plow Horse\",\"Dog\"))),\"\")","v":"Dog"},{"$f":"IFERROR(IF(J60=\"\",D59,E60*J60),D59)","v":""},{"$f":"IFERROR(IF(K60=\"\",E59,K60*$F$3),E59)","v":0},{"$f":"IFERROR(D60*H60,F59)","v":""},{"$f":"IFERROR(IF(E60=\"\",G59,E60/$E$160),G59)","v":""},{"$f":"IFERROR(IF(L60=\"\",H59,L60/J60),H59)","v":""},{"$f":"IFERROR(J60-L60,\"\")","v":""},{"$f":"J59","v":""},{"$f":"K59","v":""},{"$f":"L59","v":""}]
[]
["Baseline",{"$f":"'Cat 2 Setup'!A27","v":0},{"$f":"IFERROR(IF(AND(I62>$I$159,G62>$G$159),\"Star\",IF(AND(I62>$I$159,G62<$G$159),\"Puzzle\",IF(AND(I62<$I$159,G62>$G$159),\"Plow Horse\",\"Dog\"))),\"\")","v":"Dog"},{"$f":"IFERROR(VLOOKUP(B62,'Cat 2 Setup'!$A:$F,4,FALSE),\"\")","v":""},{"$f":"IFERROR(VLOOKUP(B62,'Cat 2 Setup'!$A:$F,3,FALSE),\"\")","v":0},{"$f":"IFERROR(VLOOKUP(B62,'Cat 2 Setup'!$A:$F,6,FALSE),\"\")","v":""},{"$f":"IFERROR(E62/$E$159,\"\")","v":""},{"$f":"IFERROR(F62/D62,\"\")","v":""},{"$f":"IFERROR(J62-L62,\"\")","v":""},{"$f":"IFERROR(D62/E62,\"\")","v":""},{"$f":"IFERROR(E62/$F$3,\"\")","v":""},{"$f":"IFERROR(J62*H62,\"\")","v":""}]
["Proposed",null,{"$f":"IFERROR(IF(AND(I63>$I$160,G63>$G$160),\"Star\",IF(AND(I63>$I$160,G63<$G$160),\"Puzzle\",IF(AND(I63<$I$160,G63>$G$160),\"Plow Horse\",\"Dog\"))),\"\")","v":"Dog"},{"$f":"IFERROR(IF(J63=\"\",D62,E63*J63),D62)","v":""},{"$f":"IFERROR(IF(K63=\"\",E62,K63*$F$3),E62)","v":0},{"$f":"IFERROR(D63*H63,F62)","v":""},{"$f":"IFERROR(IF(E63=\"\",G62,E63/$E$160),G62)","v":""},{"$f":"IFERROR(IF(L63=\"\",H62,L63/J63),H62)","v":""},{"$f":"IFERROR(J63-L63,\"\")","v":""},{"$f":"J62","v":""},{"$f":"K62","v":""},{"$f":"L62","v":""}]
[]
["Baseline",{"$f":"'Cat 2 Setup'!A28","v":0},{"$f":"IFERROR(IF(AND(I65>$I$159,G65>$G$159),\"Star\",IF(AND(I65>$I$159,G65<$G$159),\"Puzzle\",IF(AND(I65<$I$159,G65>$G$159),\"Plow Horse\",\"Dog\"))),\"\")","v":"Dog"},{"$f":"IFERROR(VLOOKUP(B65,'Cat 2 Setup'!$A:$F,4,FALSE),\"\")","v":""},{"$f":"IFERROR(VLOOKUP(B65,'Cat 2 Setup'!$A:$F,3,FALSE),\"\")","v":0},{"$f":"IFERROR(VLOOKUP(B65,'Cat 2 Setup'!$A:$F,6,FALSE),\"\")","v":""},{"$f":"IFERROR(E65/$E$159,\"\")","v":""},{"$f":"IFERROR(F65/D65,\"\")","v":""},{"$f":"IFERROR(J65-L65,\"\")","v":""},{"$f":"IFERROR(D65/E65,\"\")","v":""},{"$f":"IFERROR(E65/$F$3,\"\")","v":""},{"$f":"IFERROR(J65*H65,\"\")","v":""}]
["Proposed",null,{"$f":"IFERROR(IF(AND(I66>$I$160,G66>$G$160),\"Star\",IF(AND(I66>$I$160,G66<$G$160),\"Puzzle\",IF(AND(I66<$I$160,G66>$G$160),\"Plow Horse\",\"Dog\"))),\"\")","v":"Dog"},{"$f":"IFERROR(IF(J66=\"\",D65,E66*J66),D65)","v":""},{"$f":"IFERROR(IF(K66=\"\",E65,K66*$F$3),E65)","v":0},{"$f":"IFERROR(D66*H66,F65)","v":""},{"$f":"IFERROR(IF(E66=\"\",G65,E66/$E$160),G65)","v":""},{"$f":"IFERROR(IF(L66=\"\",H65,L66/J66),H65)","v":""},{"$f":"IFERROR(J66-L66,\"\")","v":""},{"$f":"J65","v":""},{"$f":"K65","v":""},{"$f":"L65","v":""}]
[]
["Baseline",{"$f":"'Cat 2 Setup'!A29","v":0},{"$f":"IFERROR(IF(AND(I68>$I$159,G68>$G$159),\"Star\",IF(AND(I68>$I$159,G68<$G$159),\"Puzzle\",IF(AND(I68<$I$159,G68>$G$159),\"Plow Horse\",\"Dog\"))),\"\")","v":"Dog"},{"$f":"IFERROR(VLOOKUP(B68,'Cat 2 Setup'!$A:$F,4,FALSE),\"\")","v":""},{"$f":"IFERROR(VLOOKUP(B68,'Cat 2 Setup'!$A:$F,3,FALSE),\"\")","v":0},{"$f":"IFERROR(VLOOKUP(B68,'Cat 2 Setup'!$A:$F,6,FALSE),\"\")","v":""},{"$f":"IFERROR(E68/$E$159,\"\")","v":""},{"$f":"IFERROR(F68/D68,\"\")","v":""},{"$f":"IFERROR(J68-L68,\"\")","v":""},{"$f":"IFERROR(D68/E68,\"\")","v":""},{"$f":"IFERROR(E68/$F$3,\"\")","v":""},{"$f":"IFERROR(J68*H68,\"\")","v":""}]
["Proposed",null,{"$f":"IFERROR(IF(AND(I69>$I$160,G69>$G$160),\"Star\",IF(AND(I69>$I$160,G69<$G$160),\"Puzzle\",IF(AND(I69<$I$160,G69>$G$160),\"Plow Horse\",\"Dog\"))),\"\")","v":"Dog"},{"$f":"IFERROR(IF(J69=\"\",D68,E69*J69),D68)","v":""},{"$f":"IFERROR(IF(K69=\"\",E68,K69*$F$3),E68)","v":0},{"$f":"IFERROR(D69*H69,F68)","v":""},{"$f":"IFERROR(IF(E69=\"\",G68,E69/$E$160),G68)","v":""},{"$f":"IFERROR(IF(L69=\"\",H68,L69/J69),H68)","v":""},{"$f":"IFERROR(J69-L69,\"\")","v":""},{"$f":"J68","v":""},{"$f":"K68","v":""},{"$f":"L68","v":""}]
[]
["Baseline",{"$f":"'Cat 2 Setup'!A30","v":0},{"$f":"IFERROR(IF(AND(I71>$I$159,G71>$G$159),\"Star\",IF(AND(I71>$I$159,G71<$G$159),\"Puzzle\",IF(AND(I71<$I$159,G71>$G$159),\"Plow Horse\",\"Dog\"))),\"\")","v":"Dog"},{"$f":"IFERROR(VLOOKUP(B71,'Cat 2 Setup'!$A:$F,4,FALSE),\"\")","v":""},{"$f":"IFERROR(VLOOKUP(B71,'Cat 2 Setup'!$A:$F,3,FALSE),\"\")","v":0},{"$f":"IFERROR(VLOOKUP(B71,'Cat 2 Setup'!$A:$F,6,FALSE),\"\")","v":""},{"$f":"IFERROR(E71/$E$159,\"\")","v":""},{"$f":"IFERROR(F71/D71,\"\")","v":""},{"$f":"IFERROR(J71-L71,\"\")","v":""},{"$f":"IFERROR(D71/E71,\"\")","v":""},{"$f":"IFERROR(E71/$F$3,\"\")","v":""},{"$f":"IFERROR(J71*H71,\"\")","v":""}]
["Proposed",null,{"$f":"IFERROR(IF(AND(I72>$I$160,G72>$G$160),\"Star\",IF(AND(I72>$I$160,G72<$G$160),\"Puzzle\",IF(AND(I72<$I$160,G72>$G$160),\"Plow Horse\",\"Dog\"))),\"\")","v":"Dog"},{"$f":"IFERROR(IF(J72=\"\",D71,E72*J72),D71)","v":""},{"$f":"IFERROR(IF(K72=\"\",E71,K72*$F$3),E71)","v":0},{"$f":"IFERROR(D72*H72,F71)","v":""},{"$f":"IFERROR(IF(E72=\"\",G71,E72/$E$160),G71)","v":""},{"$f":"IFERROR(IF(L72=\"\",H71,L72/J72),H71)","v":""},{"$f":"IFERROR(J72-L72,\"\")","v":""},{"$f":"J71","v":""},{"$f":"K71","v":""},{"$f":"L71","v":""}]
[]
["Baseline",{"$f":"'Cat 2 Setup'!A31","v":0},{"$f":"IFERROR(IF(AND(I74>$I$159,G74>$G$159),\"Star\",IF(AND(I74>$I$159,G74<$G$159),\"Puzzle\",IF(AND(I74<$I$159,G74>$G$159),\"Plow Horse\",\"Dog\"))),\"\")","v":"Dog"},{"$f":"IFERROR(VLOOKUP(B74,'Cat 2 Setup'!$A:$F,4,FALSE),\"\")","v":""},{"$f":"IFERROR(VLOOKUP(B74,'Cat 2 Setup'!$A:$F,3,FALSE),\"\")","v":0},{"$f":"IFERROR(VLOOKUP(B74,'Cat 2 Setup'!$A:$F,6,FALSE),\"\")","v":""},{"$f":"IFERROR(E74/$E$159,\"\")","v":""},{"$f":"IFERROR(F74/D74,\"\")","v":""},{"$f":"IFERROR(J74-L74,\"\")","v":""},{"$f":"IFERROR(D74/E74,\"\")","v":""},{"$f":"IFERROR(E74/$F$3,\"\")","v":""},{"$f":"IFERROR(J74*H74,\"\")","v":""}]
["Proposed",null,{"$f":"IFERROR(IF(AND(I75>$I$160,G75>$G$160),\"Star\",IF(AND(I75>$I$160,G75<$G$160),\"Puzzle\",IF(AND(I75<$I$160,G75>$G$160),\"Plow Horse\",\"Dog\"))),\"\")","v":"Dog"},{"$f":"IFERROR(IF(J75=\"\",D74,E75*J75),D74)","v":""},{"$f":"IFERROR(IF(K75=\"\",E74,K75*$F$3),E74)","v":0},{"$f":"IFERROR(D75*H75,F74)","v":""},{"$f":"IFERROR(IF(E75=\"\",G74,E75/$E$160),G74)","v":""},{"$f":"IFERROR(IF(L75=\"\",H74,L75/J75),H74)","v":""},{"$f":"IFERROR(J75-L75,\"\")","v":""},{"$f":"J74","v":""},{"$f":"K74","v":""},{"$f":"L74","v":""}]
[]
["Baseline",{"$f":"'Cat 2 Setup'!A32","v":0},{"$f":"IFERROR(IF(AND(I77>$I$159,G77>$G$159),\"Star\",IF(AND(I77>$I$159,G77<$G$159),\"Puzzle\",IF(AND(I77<$I$159,G77>$G$159),\"Plow Horse\",\"Dog\"))),\"\")","v":"Dog"},{"$f":"IFERROR(VLOOKUP(B77,'Cat 2 Setup'!$A:$F,4,FALSE),\"\")","v":""},{"$f":"IFERROR(VLOOKUP(B77,'Cat 2 Setup'!$A:$F,3,FALSE),\"\")","v":0},{"$f":"IFERROR(VLOOKUP(B77,'Cat 2 Setup'!$A:$F,6,FALSE),\"\")","v":""},{"$f":"IFERROR(E77/$E$159,\"\")","v":""},{"$f":"IFERROR(F77/D77,\"\")","v":""},{"$f":"IFERROR(J77-L77,\"\")","v":""},{"$f":"IFERROR(D77/E77,\"\")","v":""},{"$f":"IFERROR(E77/$F$3,\"\")","v":""},{"$f":"IFERROR(J77*H77,\"\")","v":""}]
["Proposed",null,{"$f":"IFERROR(IF(AND(I78>$I$160,G78>$G$160),\"Star\",IF(AND(I78>$I$160,G78<$G$160),\"Puzzle\",IF(AND(I78<$I$160,G78>$G$160),\"Plow Horse\",\"Dog\"))),\"\")","v":"Dog"},{"$f":"IFERROR(IF(J78=\"\",D77,E78*J78),D77)","v":""},{"$f":"IFERROR(IF(K78=\"\",E77,K78*$F$3),E77)","v":0},{"$f":"IFERROR(D78*H78,F77)","v":""},{"$f":"IFERROR(IF(E78=\"\",G77,E78/$E$160),G77)","v":""},{"$f":"IFERROR(IF(L78=\"\",H77,L78/J78),H77)","v":""},{"$f":"IFERROR(J78-L78,\"\")","v":""},{"$f":"J77","v":""},{"$f":"K77","v":""},{"$f":"L77","v":""}]
[]
["Baseline",{"$f":"'Cat 2 Setup'!A33","v":0},{"$f":"IFERROR(IF(AND(I80>$I$159,G80>$G$159),\"Star\",IF(AND(I80>$I$159,G80<$G$159),\"Puzzle\",IF(AND(I80<$I$159,G80>$G$159),\"Plow Horse\",\"Dog\"))),\"\")","v":"Dog"},{"$f":"IFERROR(VLOOKUP(B80,'Cat 2 Setup'!$A:$F,4,FALSE),\"\")","v":""},{"$f":"IFERROR(VLOOKUP(B80,'Cat 2 Setup'!$A:$F,3,FALSE),\"\")","v":0},{"$f":"IFERROR(VLOOKUP(B80,'Cat 2 Setup'!$A:$F,6,FALSE),\"\")","v":""},{"$f":"IFERROR(E80/$E$159,\"\")","v":""},{"$f":"IFERROR(F80/D80,\"\")","v":""},{"$f":"IFERROR(J80-L80,\"\")","v":""},{"$f":"IFERROR(D80/E80,\"\")","v":""},{"$f":"IFERROR(E80/$F$3,\"\")","v":""},{"$f":"IFERROR(J80*H80,\"\")","v":""}]
["Proposed",null,{"$f":"IFERROR(IF(AND(I81>$I$160,G81>$G$160),\"Star\",IF(AND(I81>$I$160,G81<$G$160),\"Puzzle\",IF(AND(I81<$I$160,G81>$G$160),\"Plow Horse\",\"Dog\"))),\"\")","v":"Dog"},{"$f":"IFERROR(IF(J81=\"\",D80,E81*J81),D80)","v":""},{"$f":"IFERROR(IF(K81=\"\",E80,K81*$F$3),E80)","v":0},{"$f":"IFERROR(D81*H81,F80)","v":""},{"$f":"IFERROR(IF(E81=\"\",G80,E81/$E$160),G80)","v":""},{"$f":"IFERROR(IF(L81=\"\",H80,L81/J81),H80)","v":""},{"$f":"IFERROR(J81-L81,\"\")","v":""},{"$f":"J80","v":""},{"$f":"K80","v":""},{"$f":"L80","v":""}]
[]
["Baseline",{"$f":"'Cat 2 Setup'!A34","v":0},{"$f":"IFERROR(IF(AND(I83>$I$159,G83>$G$159),\"Star\",IF(AND(I83>$I$159,G83<$G$159),\"Puzzle\",IF(AND(I83<$I$159,G83>$G$159),\"Plow Horse\",\"Dog\"))),\"\")","v":"Dog"},{"$f":"IFERROR(VLOOKUP(B83,'Cat 2 Setup'!$A:$F,4,FALSE),\"\")","v":""},{"$f":"IFERROR(VLOOKUP(B83,'Cat 2 Setup'!$A:$F,3,FALSE),\"\")","v":0},{"$f":"IFERROR(VLOOKUP(B83,'Cat 2 Setup'!$A:$F,6,FALSE),\"\")","v":""},{"$f":"IFERROR(E83/$E$159,\"\")","v":""},{"$f":"IFERROR(F83/D83,\"\")","v":""},{"$f":"IFERROR(J83-L83,\"\")","v":""},{"$f":"IFERROR(D83/E83,\"\")","v":""},{"$f":"IFERROR(E83/$F$3,\"\")","v":""},{"$f":"IFERROR(J83*H83,\"\")","v":""}]
["Proposed",null,{"$f":"IFERROR(IF(AND(I84>$I$160,G84>$G$160),\"Star\",IF(AND(I84>$I$160,G84<$G$160),\"Puzzle\",IF(AND(I84<$I$160,G84>$G$160),\"Plow Horse\",\"Dog\"))),\"\")","v":"Dog"},{"$f":"IFERROR(IF(J84=\"\",D83,E84*J84),D83)","v":""},{"$f":"IFERROR(IF(K84=\"\",E83,K84*$F$3),E83)","v":0},{"$f":"IFERROR(D84*H84,F83)","v":""},{"$f":"IFERROR(IF(E84=\"\",G83,E84/$E$160),G83)","v":""},{"$f":"IFERROR(IF(L84=\"\",H83,L84/J84),H83)","v":""},{"$f":"IFERROR(J84-L84,\"\")","v":""},{"$f":"J83","v":""},{"$f":"K83","v":""},{"$f":"L83","v":""}]
[]
["Baseline",{"$f":"'Cat 2 Setup'!A35","v":0},{"$f":"IFERROR(IF(AND(I86>$I$159,G86>$G$159),\"Star\",IF(AND(I86>$I$159,G86<$G$159),\"Puzzle\",IF(AND(I86<$I$159,G86>$G$159),\"Plow Horse\",\"Dog\"))),\"\")","v":"Dog"},{"$f":"IFERROR(VLOOKUP(B86,'Cat 2 Setup'!$A:$F,4,FALSE),\"\")","v":""},{"$f":"IFERROR(VLOOKUP(B86,'Cat 2 Setup'!$A:$F,3,FALSE),\"\")","v":0},{"$f":"IFERROR(VLOOKUP(B86,'Cat 2 Setup'!$A:$F,6,FALSE),\"\")","v":""},{"$f":"IFERROR(E86/$E$159,\"\")","v":""},{"$f":"IFERROR(F86/D86,\"\")","v":""},{"$f":"IFERROR(J86-L86,\"\")","v":""},{"$f":"IFERROR(D86/E86,\"\")","v":""},{"$f":"IFERROR(E86/$F$3,\"\")","v":""},{"$f":"IFERROR(J86*H86,\"\")","v":""}]
["Proposed",null,{"$f":"IFERROR(IF(AND(I87>$I$160,G87>$G$160),\"Star\",IF(AND(I87>$I$160,G87<$G$160),\"Puzzle\",IF(AND(I87<$I$160,G87>$G$160),\"Plow Horse\",\"Dog\"))),\"\")","v":"Dog"},{"$f":"IFERROR(IF(J87=\"\",D86,E87*J87),D86)","v":""},{"$f":"IFERROR(IF(K87=\"\",E86,K87*$F$3),E86)","v":0},{"$f":"IFERROR(D87*H87,F86)","v":""},{"$f":"IFERROR(IF(E87=\"\",G86,E87/$E$160),G86)","v":""},{"$f":"IFERROR(IF(L87=\"\",H86,L87/J87),H86)","v":""},{"$f":"IFERROR(J87-L87,\"\")","v":""},{"$f":"J86","v":""},{"$f":"K86","v":""},{"$f":"L86","v":""}]
[]
["Baseline",{"$f":"'Cat 2 Setup'!A36","v":0},{"$f":"IFERROR(IF(AND(I89>$I$159,G89>$G$159),\"Star\",IF(AND(I89>$I$159,G89<$G$159),\"Puzzle\",IF(AND(I89<$I$159,G89>$G$159),\"Plow Horse\",\"Dog\"))),\"\")","v":"Dog"},{"$f":"IFERROR(VLOOKUP(B89,'Cat 2 Setup'!$A:$F,4,FALSE),\"\")","v":""},{"$f":"IFERROR(VLOOKUP(B89,'Cat 2 Setup'!$A:$F,3,FALSE),\"\")","v":0},{"$f":"IFERROR(VLOOKUP(B89,'Cat 2 Setup'!$A:$F,6,FALSE),\"\")","v":""},{"$f":"IFERROR(E89/$E$159,\"\")","v":""},{"$f":"IFERROR(F89/D89,\"\")","v":""},{"$f":"IFERROR(J89-L89,\"\")","v":""},{"$f":"IFERROR(D89/E89,\"\")","v":""},{"$f":"IFERROR(E89/$F$3,\"\")","v":""},{"$f":"IFERROR(J89*H89,\"\")","v":""}]
["Proposed",null,{"$f":"IFERROR(IF(AND(I90>$I$160,G90>$G$160),\"Star\",IF(AND(I90>$I$160,G90<$G$160),\"Puzzle\",IF(AND(I90<$I$160,G90>$G$160),\"Plow Horse\",\"Dog\"))),\"\")","v":"Dog"},{"$f":"IFERROR(IF(J90=\"\",D89,E90*J90),D89)","v":""},{"$f":"IFERROR(IF(K90=\"\",E89,K90*$F$3),E89)","v":0},{"$f":"IFERROR(D90*H90,F89)","v":""},{"$f":"IFERROR(IF(E90=\"\",G89,E90/$E$160),G89)","v":""},{"$f":"IFERROR(IF(L90=\"\",H89,L90/J90),H89)","v":""},{"$f":"IFERROR(J90-L90,\"\")","v":""},{"$f":"J89","v":""},{"$f":"K89","v":""},{"$f":"L89","v":""}]
[]
["Baseline",{"$f":"'Cat 2 Setup'!A37","v":0},{"$f":"IFERROR(IF(AND(I92>$I$159,G92>$G$159),\"Star\",IF(AND(I92>$I$159,G92<$G$159),\"Puzzle\",IF(AND(I92<$I$159,G92>$G$159),\"Plow Horse\",\"Dog\"))),\"\")","v":"Dog"},{"$f":"IFERROR(VLOOKUP(B92,'Cat 2 Setup'!$A:$F,4,FALSE),\"\")","v":""},{"$f":"IFERROR(VLOOKUP(B92,'Cat 2 Setup'!$A:$F,3,FALSE),\"\")","v":0},{"$f":"IFERROR(VLOOKUP(B92,'Cat 2 Setup'!$A:$F,6,FALSE),\"\")","v":""},{"$f":"IFERROR(E92/$E$159,\"\")","v":""},{"$f":"IFERROR(F92/D92,\"\")","v":""},{"$f":"IFERROR(J92-L92,\"\")","v":""},{"$f":"IFERROR(D92/E92,\"\")","v":""},{"$f":"IFERROR(E92/$F$3,\"\")","v":""},{"$f":"IFERROR(J92*H92,\"\")","v":""}]
["Proposed",null,{"$f":"IFERROR(IF(AND(I93>$I$160,G93>$G$160),\"Star\",IF(AND(I93>$I$160,G93<$G$160),\"Puzzle\",IF(AND(I93<$I$160,G93>$G$160),\"Plow Horse\",\"Dog\"))),\"\")","v":"Dog"},{"$f":"IFERROR(IF(J93=\"\",D92,E93*J93),D92)","v":""},{"$f":"IFERROR(IF(K93=\"\",E92,K93*$F$3),E92)","v":0},{"$f":"IFERROR(D93*H93,F92)","v":""},{"$f":"IFERROR(IF(E93=\"\",G92,E93/$E$160),G92)","v":""},{"$f":"IFERROR(IF(L93=\"\",H92,L93/J93),H92)","v":""},{"$f":"IFERROR(J93-L93,\"\")","v":""},{"$f":"J92","v":""},{"$f":"K92","v":""},{"$f":"L92","v":""}]
[]
["Baseline",{"$f":"'Cat 2 Setup'!A38","v":0},{"$f":"IFERROR(IF(AND(I95>$I$159,G95>$G$159),\"Star\",IF(AND(I95>$I$159,G95<$G$159),\"Puzzle\",IF(AND(I95<$I$159,G95>$G$159),\"Plow Horse\",\"Dog\"))),\"\")","v":"Dog"},{"$f":"IFERROR(VLOOKUP(B95,'Cat 2 Setup'!$A:$F,4,FALSE),\"\")","v":""},{"$f":"IFERROR(VLOOKUP(B95,'Cat 2 Setup'!$A:$F,3,FALSE),\"\")","v":0},{"$f":"IFERROR(VLOOKUP(B95,'Cat 2 Setup'!$A:$F,6,FALSE),\"\")","v":""},{"$f":"IFERROR(E95/$E$159,\"\")","v":""},{"$f":"IFERROR(F95/D95,\"\")","v":""},{"$f":"IFERROR(J95-L95,\"\")","v":""},{"$f":"IFERROR(D95/E95,\"\")","v":""},{"$f":"IFERROR(E95/$F$3,\"\")","v":""},{"$f":"IFERROR(J95*H95,\"\")","v":""}]
["Proposed",null,{"$f":"IFERROR(IF(AND(I96>$I$160,G96>$G$160),\"Star\",IF(AND(I96>$I$160,G96<$G$160),\"Puzzle\",IF(AND(I96<$I$160,G96>$G$160),\"Plow Horse\",\"Dog\"))),\"\")","v":"Dog"},{"$f":"IFERROR(IF(J96=\"\",D95,E96*J96),D95)","v":""},{"$f":"IFERROR(IF(K96=\"\",E95,K96*$F$3),E95)","v":0},{"$f":"IFERROR(D96*H96,F95)","v":""},{"$f":"IFERROR(IF(E96=\"\",G95,E96/$E$160),G95)","v":""},{"$f":"IFERROR(IF(L96=\"\",H95,L96/J96),H95)","v":""},{"$f":"IFERROR(J96-L96,\"\")","v":""},{"$f":"J95","v":""},{"$f":"K95","v":""},{"$f":"L95","v":""}]
[]
["Baseline",{"$f":"'Cat 2 Setup'!A39","v":0},{"$f":"IFERROR(IF(AND(I98>$I$159,G98>$G$159),\"Star\",IF(AND(I98>$I$159,G98<$G$159),\"Puzzle\",IF(AND(I98<$I$159,G98>$G$159),\"Plow Horse\",\"Dog\"))),\"\")","v":"Dog"},{"$f":"IFERROR(VLOOKUP(B98,'Cat 2 Setup'!$A:$F,4,FALSE),\"\")","v":""},{"$f":"IFERROR(VLOOKUP(B98,'Cat 2 Setup'!$A:$F,3,FALSE),\"\")","v":0},{"$f":"IFERROR(VLOOKUP(B98,'Cat 2 Setup'!$A:$F,6,FALSE),\"\")","v":""},{"$f":"IFERROR(E98/$E$159,\"\")","v":""},{"$f":"IFERROR(F98/D98,\"\")","v":""},{"$f":"IFERROR(J98-L98,\"\")","v":""},{"$f":"IFERROR(D98/E98,\"\")","v":""},{"$f":"IFERROR(E98/$F$3,\"\")","v":""},{"$f":"IFERROR(J98*H98,\"\")","v":""}]
["Proposed",null,{"$f":"IFERROR(IF(AND(I99>$I$160,G99>$G$160),\"Star\",IF(AND(I99>$I$160,G99<$G$160),\"Puzzle\",IF(AND(I99<$I$160,G99>$G$160),\"Plow Horse\",\"Dog\"))),\"\")","v":"Dog"},{"$f":"IFERROR(IF(J99=\"\",D98,E99*J99),D98)","v":""},{"$f":"IFERROR(IF(K99=\"\",E98,K99*$F$3),E98)","v":0},{"$f":"IFERROR(D99*H99,F98)","v":""},{"$f":"IFERROR(IF(E99=\"\",G98,E99/$E$160),G98)","v":""},{"$f":"IFERROR(IF(L99=\"\",H98,L99/J99),H98)","v":""},{"$f":"IFERROR(J99-L99,\"\")","v":""},{"$f":"J98","v":""},{"$f":"K98","v":""},{"$f":"L98","v":""}]
[]
["Baseline",{"$f":"'Cat 2 Setup'!A40","v":0},{"$f":"IFERROR(IF(AND(I101>$I$159,G101>$G$159),\"Star\",IF(AND(I101>$I$159,G101<$G$159),\"Puzzle\",IF(AND(I101<$I$159,G101>$G$159),\"Plow Horse\",\"Dog\"))),\"\")","v":"Dog"},{"$f":"IFERROR(VLOOKUP(B101,'Cat 2 Setup'!$A:$F,4,FALSE),\"\")","v":""},{"$f":"IFERROR(VLOOKUP(B101,'Cat 2 Setup'!$A:$F,3,FALSE),\"\")","v":0},{"$f":"IFERROR(VLOOKUP(B101,'Cat 2 Setup'!$A:$F,6,FALSE),\"\")","v":""},{"$f":"IFERROR(E101/$E$159,\"\")","v":""},{"$f":"IFERROR(F101/D101,\"\")","v":""},{"$f":"IFERROR(J101-L101,\"\")","v":""},{"$f":"IFERROR(D101/E101,\"\")","v":""},{"$f":"IFERROR(E101/$F$3,\"\")","v":""},{"$f":"IFERROR(J101*H101,\"\")","v":""}]
["Proposed",null,{"$f":"IFERROR(IF(AND(I102>$I$160,G102>$G$160),\"Star\",IF(AND(I102>$I$160,G102<$G$160),\"Puzzle\",IF(AND(I102<$I$160,G102>$G$160),\"Plow Horse\",\"Dog\"))),\"\")","v":"Dog"},{"$f":"IFERROR(IF(J102=\"\",D101,E102*J102),D101)","v":""},{"$f":"IFERROR(IF(K102=\"\",E101,K102*$F$3),E101)","v":0},{"$f":"IFERROR(D102*H102,F101)","v":""},{"$f":"IFERROR(IF(E102=\"\",G101,E102/$E$160),G101)","v":""},{"$f":"IFERROR(IF(L102=\"\",H101,L102/J102),H101)","v":""},{"$f":"IFERROR(J102-L102,\"\")","v":""},{"$f":"J101","v":""},{"$f":"K101","v":""},{"$f":"L101","v":""}]
[]
["Baseline",{"$f":"'Cat 2 Setup'!A41","v":0},{"$f":"IFERROR(IF(AND(I104>$I$159,G104>$G$159),\"Star\",IF(AND(I104>$I$159,G104<$G$159),\"Puzzle\",IF(AND(I104<$I$159,G104>$G$159),\"Plow Horse\",\"Dog\"))),\"\")","v":"Dog"},{"$f":"IFERROR(VLOOKUP(B104,'Cat 2 Setup'!$A:$F,4,FALSE),\"\")","v":""},{"$f":"IFERROR(VLOOKUP(B104,'Cat 2 Setup'!$A:$F,3,FALSE),\"\")","v":0},{"$f":"IFERROR(VLOOKUP(B104,'Cat 2 Setup'!$A:$F,6,FALSE),\"\")","v":""},{"$f":"IFERROR(E104/$E$159,\"\")","v":""},{"$f":"IFERROR(F104/D104,\"\")","v":""},{"$f":"IFERROR(J104-L104,\"\")","v":""},{"$f":"IFERROR(D104/E104,\"\")","v":""},{"$f":"IFERROR(E104/$F$3,\"\")","v":""},{"$f":"IFERROR(J104*H104,\"\")","v":""}]
["Proposed",null,{"$f":"IFERROR(IF(AND(I105>$I$160,G105>$G$160),\"Star\",IF(AND(I105>$I$160,G105<$G$160),\"Puzzle\",IF(AND(I105<$I$160,G105>$G$160),\"Plow Horse\",\"Dog\"))),\"\")","v":"Dog"},{"$f":"IFERROR(IF(J105=\"\",D104,E105*J105),D104)","v":""},{"$f":"IFERROR(IF(K105=\"\",E104,K105*$F$3),E104)","v":0},{"$f":"IFERROR(D105*H105,F104)","v":""},{"$f":"IFERROR(IF(E105=\"\",G104,E105/$E$160),G104)","v":""},{"$f":"IFERROR(IF(L105=\"\",H104,L105/J105),H104)","v":""},{"$f":"IFERROR(J105-L105,\"\")","v":""},{"$f":"J104","v":""},{"$f":"K104","v":""},{"$f":"L104","v":""}]
[]
["Baseline",{"$f":"'Cat 2 Setup'!A42","v":0},{"$f":"IFERROR(IF(AND(I107>$I$159,G107>$G$159),\"Star\",IF(AND(I107>$I$159,G107<$G$159),\"Puzzle\",IF(AND(I107<$I$159,G107>$G$159),\"Plow Horse\",\"Dog\"))),\"\")","v":"Dog"},{"$f":"IFERROR(VLOOKUP(B107,'Cat 2 Setup'!$A:$F,4,FALSE),\"\")","v":""},{"$f":"IFERROR(VLOOKUP(B107,'Cat 2 Setup'!$A:$F,3,FALSE),\"\")","v":0},{"$f":"IFERROR(VLOOKUP(B107,'Cat 2 Setup'!$A:$F,6,FALSE),\"\")","v":""},{"$f":"IFERROR(E107/$E$159,\"\")","v":""},{"$f":"IFERROR(F107/D107,\"\")","v":""},{"$f":"IFERROR(J107-L107,\"\")","v":""},{"$f":"IFERROR(D107/E107,\"\")","v":""},{"$f":"IFERROR(E107/$F$3,\"\")","v":""},{"$f":"IFERROR(J107*H107,\"\")","v":""}]
["Proposed",null,{"$f":"IFERROR(IF(AND(I108>$I$160,G108>$G$160),\"Star\",IF(AND(I108>$I$160,G108<$G$160),\"Puzzle\",IF(AND(I108<$I$160,G108>$G$160),\"Plow Horse\",\"Dog\"))),\"\")","v":"Dog"},{"$f":"IFERROR(IF(J108=\"\",D107,E108*J108),D107)","v":""},{"$f":"IFERROR(IF(K108=\"\",E107,K108*$F$3),E107)","v":0},{"$f":"IFERROR(D108*H108,F107)","v":""},{"$f":"IFERROR(IF(E108=\"\",G107,E108/$E$160),G107)","v":""},{"$f":"IFERROR(IF(L108=\"\",H107,L108/J108),H107)","v":""},{"$f":"IFERROR(J108-L108,\"\")","v":""},{"$f":"J107","v":""},{"$f":"K107","v":""},{"$f":"L107","v":""}]
[]
["Baseline",{"$f":"'Cat 2 Setup'!A43","v":0},{"$f":"IFERROR(IF(AND(I110>$I$159,G110>$G$159),\"Star\",IF(AND(I110>$I$159,G110<$G$159),\"Puzzle\",IF(AND(I110<$I$159,G110>$G$159),\"Plow Horse\",\"Dog\"))),\"\")","v":"Dog"},{"$f":"IFERROR(VLOOKUP(B110,'Cat 2 Setup'!$A:$F,4,FALSE),\"\")","v":""},{"$f":"IFERROR(VLOOKUP(B110,'Cat 2 Setup'!$A:$F,3,FALSE),\"\")","v":0},{"$f":"IFERROR(VLOOKUP(B110,'Cat 2 Setup'!$A:$F,6,FALSE),\"\")","v":""},{"$f":"IFERROR(E110/$E$159,\"\")","v":""},{"$f":"IFERROR(F110/D110,\"\")","v":""},{"$f":"IFERROR(J110-L110,\"\")","v":""},{"$f":"IFERROR(D110/E110,\"\")","v":""},{"$f":"IFERROR(E110/$F$3,\"\")","v":""},{"$f":"IFERROR(J110*H110,\"\")","v":""}]
["Proposed",null,{"$f":"IFERROR(IF(AND(I111>$I$160,G111>$G$160),\"Star\",IF(AND(I111>$I$160,G111<$G$160),\"Puzzle\",IF(AND(I111<$I$160,G111>$G$160),\"Plow Horse\",\"Dog\"))),\"\")","v":"Dog"},{"$f":"IFERROR(IF(J111=\"\",D110,E111*J111),D110)","v":""},{"$f":"IFERROR(IF(K111=\"\",E110,K111*$F$3),E110)","v":0},{"$f":"IFERROR(D111*H111,F110)","v":""},{"$f":"IFERROR(IF(E111=\"\",G110,E111/$E$160),G110)","v":""},{"$f":"IFERROR(IF(L111=\"\",H110,L111/J111),H110)","v":""},{"$f":"IFERROR(J111-L111,\"\")","v":""},{"$f":"J110","v":""},{"$f":"K110","v":""},{"$f":"L110","v":""}]
[]
["Baseline",{"$f":"'Cat 2 Setup'!A44","v":0},{"$f":"IFERROR(IF(AND(I113>$I$159,G113>$G$159),\"Star\",IF(AND(I113>$I$159,G113<$G$159),\"Puzzle\",IF(AND(I113<$I$159,G113>$G$159),\"Plow Horse\",\"Dog\"))),\"\")","v":"Dog"},{"$f":"IFERROR(VLOOKUP(B113,'Cat 2 Setup'!$A:$F,4,FALSE),\"\")","v":""},{"$f":"IFERROR(VLOOKUP(B113,'Cat 2 Setup'!$A:$F,3,FALSE),\"\")","v":0},{"$f":"IFERROR(VLOOKUP(B113,'Cat 2 Setup'!$A:$F,6,FALSE),\"\")","v":""},{"$f":"IFERROR(E113/$E$159,\"\")","v":""},{"$f":"IFERROR(F113/D113,\"\")","v":""},{"$f":"IFERROR(J113-L113,\"\")","v":""},{"$f":"IFERROR(D113/E113,\"\")","v":""},{"$f":"IFERROR(E113/$F$3,\"\")","v":""},{"$f":"IFERROR(J113*H113,\"\")","v":""}]
["Proposed",null,{"$f":"IFERROR(IF(AND(I114>$I$160,G114>$G$160),\"Star\",IF(AND(I114>$I$160,G114<$G$160),\"Puzzle\",IF(AND(I114<$I$160,G114>$G$160),\"Plow Horse\",\"Dog\"))),\"\")","v":"Dog"},{"$f":"IFERROR(IF(J114=\"\",D113,E114*J114),D113)","v":""},{"$f":"IFERROR(IF(K114=\"\",E113,K114*$F$3),E113)","v":0},{"$f":"IFERROR(D114*H114,F113)","v":""},{"$f":"IFERROR(IF(E114=\"\",G113,E114/$E$160),G113)","v":""},{"$f":"IFERROR(IF(L114=\"\",H113,L114/J114),H113)","v":""},{"$f":"IFERROR(J114-L114,\"\")","v":""},{"$f":"J113","v":""},{"$f":"K113","v":""},{"$f":"L113","v":""}]
[]
["Baseline",{"$f":"'Cat 2 Setup'!A45","v":0},{"$f":"IFERROR(IF(AND(I116>$I$159,G116>$G$159),\"Star\",IF(AND(I116>$I$159,G116<$G$159),\"Puzzle\",IF(AND(I116<$I$159,G116>$G$159),\"Plow Horse\",\"Dog\"))),\"\")","v":"Dog"},{"$f":"IFERROR(VLOOKUP(B116,'Cat 2 Setup'!$A:$F,4,FALSE),\"\")","v":""},{"$f":"IFERROR(VLOOKUP(B116,'Cat 2 Setup'!$A:$F,3,FALSE),\"\")","v":0},{"$f":"IFERROR(VLOOKUP(B116,'Cat 2 Setup'!$A:$F,6,FALSE),\"\")","v":""},{"$f":"IFERROR(E116/$E$159,\"\")","v":""},{"$f":"IFERROR(F116/D116,\"\")","v":""},{"$f":"IFERROR(J116-L116,\"\")","v":""},{"$f":"IFERROR(D116/E116,\"\")","v":""},{"$f":"IFERROR(E116/$F$3,\"\")","v":""},{"$f":"IFERROR(J116*H116,\"\")","v":""}]
["Proposed",null,{"$f":"IFERROR(IF(AND(I117>$I$160,G117>$G$160),\"Star\",IF(AND(I117>$I$160,G117<$G$160),\"Puzzle\",IF(AND(I117<$I$160,G117>$G$160),\"Plow Horse\",\"Dog\"))),\"\")","v":"Dog"},{"$f":"IFERROR(IF(J117=\"\",D116,E117*J117),D116)","v":""},{"$f":"IFERROR(IF(K117=\"\",E116,K117*$F$3),E116)","v":0},{"$f":"IFERROR(D117*H117,F116)","v":""},{"$f":"IFERROR(IF(E117=\"\",G116,E117/$E$160),G116)","v":""},{"$f":"IFERROR(IF(L117=\"\",H116,L117/J117),H116)","v":""},{"$f":"IFERROR(J117-L117,\"\")","v":""},{"$f":"J116","v":""},{"$f":"K116","v":""},{"$f":"L116","v":""}]
[]
["Baseline",{"$f":"'Cat 2 Setup'!A46","v":0},{"$f":"IFERROR(IF(AND(I119>$I$159,G119>$G$159),\"Star\",IF(AND(I119>$I$159,G119<$G$159),\"Puzzle\",IF(AND(I119<$I$159,G119>$G$159),\"Plow Horse\",\"Dog\"))),\"\")","v":"Dog"},{"$f":"IFERROR(VLOOKUP(B119,'Cat 2 Setup'!$A:$F,4,FALSE),\"\")","v":""},{"$f":"IFERROR(VLOOKUP(B119,'Cat 2 Setup'!$A:$F,3,FALSE),\"\")","v":0},{"$f":"IFERROR(VLOOKUP(B119,'Cat 2 Setup'!$A:$F,6,FALSE),\"\")","v":""},{"$f":"IFERROR(E119/$E$159,\"\")","v":""},{"$f":"IFERROR(F119/D119,\"\")","v":""},{"$f":"IFERROR(J119-L119,\"\")","v":""},{"$f":"IFERROR(D119/E119,\"\")","v":""},{"$f":"IFERROR(E119/$F$3,\"\")","v":""},{"$f":"IFERROR(J119*H119,\"\")","v":""}]
["Proposed",null,{"$f":"IFERROR(IF(AND(I120>$I$160,G120>$G$160),\"Star\",IF(AND(I120>$I$160,G120<$G$160),\"Puzzle\",IF(AND(I120<$I$160,G120>$G$160),\"Plow Horse\",\"Dog\"))),\"\")","v":"Dog"},{"$f":"IFERROR(IF(J120=\"\",D119,E120*J120),D119)","v":""},{"$f":"IFERROR(IF(K120=\"\",E119,K120*$F$3),E119)","v":0},{"$f":"IFERROR(D120*H120,F119)","v":""},{"$f":"IFERROR(IF(E120=\"\",G119,E120/$E$160),G119)","v":""},{"$f":"IFERROR(IF(L120=\"\",H119,L120/J120),H119)","v":""},{"$f":"IFERROR(J120-L120,\"\")","v":""},{"$f":"J119","v":""},{"$f":"K119","v":""},{"$f":"L119","v":""}]
[]
["Baseline",{"$f":"'Cat 2 Setup'!A47","v":0},{"$f":"IFERROR(IF(AND(I122>$I$159,G122>$G$159),\"Star\",IF(AND(I122>$I$159,G122<$G$159),\"Puzzle\",IF(AND(I122<$I$159,G122>$G$159),\"Plow Horse\",\"Dog\"))),\"\")","v":"Dog"},{"$f":"IFERROR(VLOOKUP(B122,'Cat 2 Setup'!$A:$F,4,FALSE),\"\")","v":""},{"$f":"IFERROR(VLOOKUP(B122,'Cat 2 Setup'!$A:$F,3,FALSE),\"\")","v":0},{"$f":"IFERROR(VLOOKUP(B122,'Cat 2 Setup'!$A:$F,6,FALSE),\"\")","v":""},{"$f":"IFERROR(E122/$E$159,\"\")","v":""},{"$f":"IFERROR(F122/D122,\"\")","v":""},{"$f":"IFERROR(J122-L122,\"\")","v":""},{"$f":"IFERROR(D122/E122,\"\")","v":""},{"$f":"IFERROR(E122/$F$3,\"\")","v":""},{"$f":"IFERROR(J122*H122,\"\")","v":""}]
["Proposed",null,{"$f":"IFERROR(IF(AND(I123>$I$160,G123>$G$160),\"Star\",IF(AND(I123>$I$160,G123<$G$160),\"Puzzle\",IF(AND(I123<$I$160,G123>$G$160),\"Plow Horse\",\"Dog\"))),\"\")","v":"Dog"},{"$f":"IFERROR(IF(J123=\"\",D122,E123*J123),D122)","v":""},{"$f":"IFERROR(IF(K123=\"\",E122,K123*$F$3),E122)","v":0},{"$f":"IFERROR(D123*H123,F122)","v":""},{"$f":"IFERROR(IF(E123=\"\",G122,E123/$E$160),G122)","v":""},{"$f":"IFERROR(IF(L123=\"\",H122,L123/J123),H122)","v":""},"",{"$f":"J122","v":""},{"$f":"K122","v":""},{"$f":"L122","v":""}]
[]
["Baseline",{"$f":"'Cat 2 Setup'!A48","v":0},{"$f":"IFERROR(IF(AND(I125>$I$159,G125>$G$159),\"Star\",IF(AND(I125>$I$159,G125<$G$159),\"Puzzle\",IF(AND(I125<$I$159,G125>$G$159),\"Plow Horse\",\"Dog\"))),\"\")","v":"Dog"},{"$f":"IFERROR(VLOOKUP(B125,'Cat 2 Setup'!$A:$F,4,FALSE),\"\")","v":""},{"$f":"IFERROR(VLOOKUP(B125,'Cat 2 Setup'!$A:$F,3,FALSE),\"\")","v":0},{"$f":"IFERROR(VLOOKUP(B125,'Cat 2 Setup'!$A:$F,6,FALSE),\"\")","v":""},{"$f":"IFERROR(E125/$E$159,\"\")","v":""},{"$f":"IFERROR(F125/D125,\"\")","v":""},{"$f":"IFERROR(J125-L125,\"\")","v":""},{"$f":"IFERROR(D125/E125,\"\")","v":""},{"$f":"IFERROR(E125/$F$3,\"\")","v":""},{"$f":"IFERROR(J125*H125,\"\")","v":""}]
["Proposed",null,{"$f":"IFERROR(IF(AND(I126>$I$160,G126>$G$160),\"Star\",IF(AND(I126>$I$160,G126<$G$160),\"Puzzle\",IF(AND(I126<$I$160,G126>$G$160),\"Plow Horse\",\"Dog\"))),\"\")","v":"Dog"},{"$f":"IFERROR(IF(J126=\"\",D125,E126*J126),D125)","v":""},{"$f":"IFERROR(IF(K126=\"\",E125,K126*$F$3),E125)","v":0},{"$f":"IFERROR(D126*H126,F125)","v":""},{"$f":"IFERROR(IF(E126=\"\",G125,E126/$E$160),G125)","v":""},{"$f":"IFERROR(IF(L126=\"\",H125,L126/J126),H125)","v":""},"",{"$f":"J125","v":""},{"$f":"K125","v":""},{"$f":"L125","v":""}]
[]
["Baseline",{"$f":"'Cat 2 Setup'!A49","v":0},{"$f":"IFERROR(IF(AND(I128>$I$159,G128>$G$159),\"Star\",IF(AND(I128>$I$159,G128<$G$159),\"Puzzle\",IF(AND(I128<$I$159,G128>$G$159),\"Plow Horse\",\"Dog\"))),\"\")","v":"Dog"},{"$f":"IFERROR(VLOOKUP(B128,'Cat 2 Setup'!$A:$F,4,FALSE),\"\")","v":""},{"$f":"IFERROR(VLOOKUP(B128,'Cat 2 Setup'!$A:$F,3,FALSE),\"\")","v":0},{"$f":"IFERROR(VLOOKUP(B128,'Cat 2 Setup'!$A:$F,6,FALSE),\"\")","v":""},{"$f":"IFERROR(E128/$E$159,\"\")","v":""},{"$f":"IFERROR(F128/D128,\"\")","v":""},{"$f":"IFERROR(J128-L128,\"\")","v":""},{"$f":"IFERROR(D128/E128,\"\")","v":""},{"$f":"IFERROR(E128/$F$3,\"\")","v":""},{"$f":"IFERROR(J128*H128,\"\")","v":""}]
["Proposed",null,{"$f":"IFERROR(IF(AND(I129>$I$160,G129>$G$160),\"Star\",IF(AND(I129>$I$160,G129<$G$160),\"Puzzle\",IF(AND(I129<$I$160,G129>$G$160),\"Plow Horse\",\"Dog\"))),\"\")","v":"Dog"},{"$f":"IFERROR(IF(J129=\"\",D128,E129*J129),D128)","v":""},{"$f":"IFERROR(IF(K129=\"\",E128,K129*$F$3),E128)","v":0},{"$f":"IFERROR(D129*H129,F128)","v":""},{"$f":"IFERROR(IF(E129=\"\",G128,E129/$E$160),G128)","v":""},{"$f":"IFERROR(IF(L129=\"\",H128,L129/J129),H128)","v":""},"",{"$f":"J128","v":""},{"$f":"K128","v":""},{"$f":"L128","v":""}]
[]
["Baseline",{"$f":"'Cat 2 Setup'!A50","v":0},{"$f":"IFERROR(IF(AND(I131>$I$159,G131>$G$159),\"Star\",IF(AND(I131>$I$159,G131<$G$159),\"Puzzle\",IF(AND(I131<$I$159,G131>$G$159),\"Plow Horse\",\"Dog\"))),\"\")","v":"Dog"},{"$f":"IFERROR(VLOOKUP(B131,'Cat 2 Setup'!$A:$F,4,FALSE),\"\")","v":""},{"$f":"IFERROR(VLOOKUP(B131,'Cat 2 Setup'!$A:$F,3,FALSE),\"\")","v":0},{"$f":"IFERROR(VLOOKUP(B131,'Cat 2 Setup'!$A:$F,6,FALSE),\"\")","v":""},{"$f":"IFERROR(E131/$E$159,\"\")","v":""},{"$f":"IFERROR(F131/D131,\"\")","v":""},{"$f":"IFERROR(J131-L131,\"\")","v":""},{"$f":"IFERROR(D131/E131,\"\")","v":""},{"$f":"IFERROR(E131/$F$3,\"\")","v":""},{"$f":"IFERROR(J131*H131,\"\")","v":""}]
["Proposed",null,{"$f":"IFERROR(IF(AND(I132>$I$160,G132>$G$160),\"Star\",IF(AND(I132>$I$160,G132<$G$160),\"Puzzle\",IF(AND(I132<$I$160,G132>$G$160),\"Plow Horse\",\"Dog\"))),\"\")","v":"Dog"},{"$f":"IFERROR(IF(J132=\"\",D131,E132*J132),D131)","v":""},{"$f":"IFERROR(IF(K132=\"\",E131,K132*$F$3),E131)","v":0},{"$f":"IFERROR(D132*H132,F131)","v":""},{"$f":"IFERROR(IF(E132=\"\",G131,E132/$E$160),G131)","v":""},{"$f":"IFERROR(IF(L132=\"\",H131,L132/J132),H131)","v":""},"",{"$f":"J131","v":""},{"$f":"K131","v":""},{"$f":"L131","v":""}]
[]
["Baseline",{"$f":"'Cat 2 Setup'!A51","v":0},{"$f":"IFERROR(IF(AND(I134>$I$159,G134>$G$159),\"Star\",IF(AND(I134>$I$159,G134<$G$159),\"Puzzle\",IF(AND(I134<$I$159,G134>$G$159),\"Plow Horse\",\"Dog\"))),\"\")","v":"Dog"},{"$f":"IFERROR(VLOOKUP(B134,'Cat 2 Setup'!$A:$F,4,FALSE),\"\")","v":""},{"$f":"IFERROR(VLOOKUP(B134,'Cat 2 Setup'!$A:$F,3,FALSE),\"\")","v":0},{"$f":"IFERROR(VLOOKUP(B134,'Cat 2 Setup'!$A:$F,6,FALSE),\"\")","v":""},{"$f":"IFERROR(E134/$E$159,\"\")","v":""},{"$f":"IFERROR(F134/D134,\"\")","v":""},{"$f":"IFERROR(J134-L134,\"\")","v":""},{"$f":"IFERROR(D134/E134,\"\")","v":""},{"$f":"IFERROR(E134/$F$3,\"\")","v":""},{"$f":"IFERROR(J134*H134,\"\")","v":""}]
["Proposed",null,{"$f":"IFERROR(IF(AND(I135>$I$160,G135>$G$160),\"Star\",IF(AND(I135>$I$160,G135<$G$160),\"Puzzle\",IF(AND(I135<$I$160,G135>$G$160),\"Plow Horse\",\"Dog\"))),\"\")","v":"Dog"},{"$f":"IFERROR(IF(J135=\"\",D134,E135*J135),D134)","v":""},{"$f":"IFERROR(IF(K135=\"\",E134,K135*$F$3),E134)","v":0},{"$f":"IFERROR(D135*H135,F134)","v":""},{"$f":"IFERROR(IF(E135=\"\",G134,E135/$E$160),G134)","v":""},{"$f":"IFERROR(IF(L135=\"\",H134,L135/J135),H134)","v":""},"",{"$f":"J134","v":""},{"$f":"K134","v":""},{"$f":"L134","v":""}]
[]
["Baseline",{"$f":"'Cat 2 Setup'!A52","v":0},{"$f":"IFERROR(IF(AND(I137>$I$159,G137>$G$159),\"Star\",IF(AND(I137>$I$159,G137<$G$159),\"Puzzle\",IF(AND(I137<$I$159,G137>$G$159),\"Plow Horse\",\"Dog\"))),\"\")","v":"Dog"},{"$f":"IFERROR(VLOOKUP(B137,'Cat 2 Setup'!$A:$F,4,FALSE),\"\")","v":""},{"$f":"IFERROR(VLOOKUP(B137,'Cat 2 Setup'!$A:$F,3,FALSE),\"\")","v":0},{"$f":"IFERROR(VLOOKUP(B137,'Cat 2 Setup'!$A:$F,6,FALSE),\"\")","v":""},{"$f":"IFERROR(E137/$E$159,\"\")","v":""},{"$f":"IFERROR(F137/D137,\"\")","v":""},{"$f":"IFERROR(J137-L137,\"\")","v":""},{"$f":"IFERROR(D137/E137,\"\")","v":""},{"$f":"IFERROR(E137/$F$3,\"\")","v":""},{"$f":"IFERROR(J137*H137,\"\")","v":""}]
["Proposed",null,{"$f":"IFERROR(IF(AND(I138>$I$160,G138>$G$160),\"Star\",IF(AND(I138>$I$160,G138<$G$160),\"Puzzle\",IF(AND(I138<$I$160,G138>$G$160),\"Plow Horse\",\"Dog\"))),\"\")","v":"Dog"},{"$f":"IFERROR(IF(J138=\"\",D137,E138*J138),D137)","v":""},{"$f":"IFERROR(IF(K138=\"\",E137,K138*$F$3),E137)","v":0},{"$f":"IFERROR(D138*H138,F137)","v":""},{"$f":"IFERROR(IF(E138=\"\",G137,E138/$E$160),G137)","v":""},{"$f":"IFERROR(IF(L138=\"\",H137,L138/J138),H137)","v":""},"",{"$f":"J137","v":""},{"$f":"K137","v":""},{"$f":"L137","v":""}]
[]
["Baseline",{"$f":"'Cat 2 Setup'!A53","v":0},{"$f":"IFERROR(IF(AND(I140>$I$159,G140>$G$159),\"Star\",IF(AND(I140>$I$159,G140<$G$159),\"Puzzle\",IF(AND(I140<$I$159,G140>$G$159),\"Plow Horse\",\"Dog\"))),\"\")","v":"Dog"},{"$f":"IFERROR(VLOOKUP(B140,'Cat 2 Setup'!$A:$F,4,FALSE),\"\")","v":""},{"$f":"IFERROR(VLOOKUP(B140,'Cat 2 Setup'!$A:$F,3,FALSE),\"\")","v":0},{"$f":"IFERROR(VLOOKUP(B140,'Cat 2 Setup'!$A:$F,6,FALSE),\"\")","v":""},{"$f":"IFERROR(E140/$E$159,\"\")","v":""},{"$f":"IFERROR(F140/D140,\"\")","v":""},{"$f":"IFERROR(J140-L140,\"\")","v":""},{"$f":"IFERROR(D140/E140,\"\")","v":""},{"$f":"IFERROR(E140/$F$3,\"\")","v":""},{"$f":"IFERROR(J140*H140,\"\")","v":""}]
["Proposed",null,{"$f":"IFERROR(IF(AND(I141>$I$160,G141>$G$160),\"Star\",IF(AND(I141>$I$160,G141<$G$160),\"Puzzle\",IF(AND(I141<$I$160,G141>$G$160),\"Plow Horse\",\"Dog\"))),\"\")","v":"Dog"},{"$f":"IFERROR(IF(J141=\"\",D140,E141*J141),D140)","v":""},{"$f":"IFERROR(IF(K141=\"\",E140,K141*$F$3),E140)","v":0},{"$f":"IFERROR(D141*H141,F140)","v":""},{"$f":"IFERROR(IF(E141=\"\",G140,E141/$E$160),G140)","v":""},{"$f":"IFERROR(IF(L141=\"\",H140,L141/J141),H140)","v":""},"",{"$f":"J140","v":""},{"$f":"K140","v":""},{"$f":"L140","v":""}]
[]
["Baseline",{"$f":"'Cat 2 Setup'!A54","v":0},{"$f":"IFERROR(IF(AND(I143>$I$159,G143>$G$159),\"Star\",IF(AND(I143>$I$159,G143<$G$159),\"Puzzle\",IF(AND(I143<$I$159,G143>$G$159),\"Plow Horse\",\"Dog\"))),\"\")","v":"Dog"},{"$f":"IFERROR(VLOOKUP(B143,'Cat 2 Setup'!$A:$F,4,FALSE),\"\")","v":""},{"$f":"IFERROR(VLOOKUP(B143,'Cat 2 Setup'!$A:$F,3,FALSE),\"\")","v":0},{"$f":"IFERROR(VLOOKUP(B143,'Cat 2 Setup'!$A:$F,6,FALSE),\"\")","v":""},{"$f":"IFERROR(E143/$E$159,\"\")","v":""},{"$f":"IFERROR(F143/D143,\"\")","v":""},{"$f":"IFERROR(J143-L143,\"\")","v":""},{"$f":"IFERROR(D143/E143,\"\")","v":""},{"$f":"IFERROR(E143/$F$3,\"\")","v":""},{"$f":"IFERROR(J143*H143,\"\")","v":""}]
["Proposed",null,{"$f":"IFERROR(IF(AND(I144>$I$160,G144>$G$160),\"Star\",IF(AND(I144>$I$160,G144<$G$160),\"Puzzle\",IF(AND(I144<$I$160,G144>$G$160),\"Plow Horse\",\"Dog\"))),\"\")","v":"Dog"},{"$f":"IFERROR(IF(J144=\"\",D143,E144*J144),D143)","v":""},{"$f":"IFERROR(IF(K144=\"\",E143,K144*$F$3),E143)","v":0},{"$f":"IFERROR(D144*H144,F143)","v":""},{"$f":"IFERROR(IF(E144=\"\",G143,E144/$E$160),G143)","v":""},{"$f":"IFERROR(IF(L144=\"\",H143,L144/J144),H143)","v":""},"",{"$f":"J143","v":""},{"$f":"K143","v":""},{"$f":"L143","v":""}]
[]
["Baseline",{"$f":"'Cat 2 Setup'!A55","v":0},{"$f":"IFERROR(IF(AND(I146>$I$159,G146>$G$159),\"Star\",IF(AND(I146>$I$159,G146<$G$159),\"Puzzle\",IF(AND(I146<$I$159,G146>$G$159),\"Plow Horse\",\"Dog\"))),\"\")","v":"Dog"},{"$f":"IFERROR(VLOOKUP(B146,'Cat 2 Setup'!$A:$F,4,FALSE),\"\")","v":""},{"$f":"IFERROR(VLOOKUP(B146,'Cat 2 Setup'!$A:$F,3,FALSE),\"\")","v":0},{"$f":"IFERROR(VLOOKUP(B146,'Cat 2 Setup'!$A:$F,6,FALSE),\"\")","v":""},{"$f":"IFERROR(E146/$E$159,\"\")","v":""},{"$f":"IFERROR(F146/D146,\"\")","v":""},{"$f":"IFERROR(J146-L146,\"\")","v":""},{"$f":"IFERROR(D146/E146,\"\")","v":""},{"$f":"IFERROR(E146/$F$3,\"\")","v":""},{"$f":"IFERROR(J146*H146,\"\")","v":""}]
["Proposed",null,{"$f":"IFERROR(IF(AND(I147>$I$160,G147>$G$160),\"Star\",IF(AND(I147>$I$160,G147<$G$160),\"Puzzle\",IF(AND(I147<$I$160,G147>$G$160),\"Plow Horse\",\"Dog\"))),\"\")","v":"Dog"},{"$f":"IFERROR(IF(J147=\"\",D146,E147*J147),D146)","v":""},{"$f":"IFERROR(IF(K147=\"\",E146,K147*$F$3),E146)","v":0},{"$f":"IFERROR(D147*H147,F146)","v":""},{"$f":"IFERROR(IF(E147=\"\",G146,E147/$E$160),G146)","v":""},{"$f":"IFERROR(IF(L147=\"\",H146,L147/J147),H146)","v":""},"",{"$f":"J146","v":""},{"$f":"K146","v":""},{"$f":"L146","v":""}]
[]
["Baseline",{"$f":"'Cat 2 Setup'!A56","v":0},{"$f":"IFERROR(IF(AND(I149>$I$159,G149>$G$159),\"Star\",IF(AND(I149>$I$159,G149<$G$159),\"Puzzle\",IF(AND(I149<$I$159,G149>$G$159),\"Plow Horse\",\"Dog\"))),\"\")","v":"Dog"},{"$f":"IFERROR(VLOOKUP(B149,'Cat 2 Setup'!$A:$F,4,FALSE),\"\")","v":""},{"$f":"IFERROR(VLOOKUP(B149,'Cat 2 Setup'!$A:$F,3,FALSE),\"\")","v":0},{"$f":"IFERROR(VLOOKUP(B149,'Cat 2 Setup'!$A:$F,6,FALSE),\"\")","v":""},{"$f":"IFERROR(E149/$E$159,\"\")","v":""},{"$f":"IFERROR(F149/D149,\"\")","v":""},{"$f":"IFERROR(J149-L149,\"\")","v":""},{"$f":"IFERROR(D149/E149,\"\")","v":""},{"$f":"IFERROR(E149/$F$3,\"\")","v":""},{"$f":"IFERROR(J149*H149,\"\")","v":""}]
["Proposed",null,{"$f":"IFERROR(IF(AND(I150>$I$160,G150>$G$160),\"Star\",IF(AND(I150>$I$160,G150<$G$160),\"Puzzle\",IF(AND(I150<$I$160,G150>$G$160),\"Plow Horse\",\"Dog\"))),\"\")","v":"Dog"},{"$f":"IFERROR(IF(J150=\"\",D149,E150*J150),D149)","v":""},{"$f":"IFERROR(IF(K150=\"\",E149,K150*$F$3),E149)","v":0},{"$f":"IFERROR(D150*H150,F149)","v":""},{"$f":"IFERROR(IF(E150=\"\",G149,E150/$E$160),G149)","v":""},{"$f":"IFERROR(IF(L150=\"\",H149,L150/J150),H149)","v":""},"",{"$f":"J149","v":""},{"$f":"K149","v":""},{"$f":"L149","v":""}]
[]
["Baseline",{"$f":"'Cat 2 Setup'!A57","v":0},{"$f":"IFERROR(IF(AND(I152>$I$159,G152>$G$159),\"Star\",IF(AND(I152>$I$159,G152<$G$159),\"Puzzle\",IF(AND(I152<$I$159,G152>$G$159),\"Plow Horse\",\"Dog\"))),\"\")","v":"Dog"},{"$f":"IFERROR(VLOOKUP(B152,'Cat 2 Setup'!$A:$F,4,FALSE),\"\")","v":""},{"$f":"IFERROR(VLOOKUP(B152,'Cat 2 Setup'!$A:$F,3,FALSE),\"\")","v":0},{"$f":"IFERROR(VLOOKUP(B152,'Cat 2 Setup'!$A:$F,6,FALSE),\"\")","v":""},{"$f":"IFERROR(E152/$E$159,\"\")","v":""},{"$f":"IFERROR(F152/D152,\"\")","v":""},{"$f":"IFERROR(J152-L152,\"\")","v":""},{"$f":"IFERROR(D152/E152,\"\")","v":""},{"$f":"IFERROR(E152/$F$3,\"\")","v":""},{"$f":"IFERROR(J152*H152,\"\")","v":""}]
["Proposed",null,{"$f":"IFERROR(IF(AND(I153>$I$160,G153>$G$160),\"Star\",IF(AND(I153>$I$160,G153<$G$160),\"Puzzle\",IF(AND(I153<$I$160,G153>$G$160),\"Plow Horse\",\"Dog\"))),\"\")","v":"Dog"},{"$f":"IFERROR(IF(J153=\"\",D152,E153*J153),D152)","v":""},{"$f":"IFERROR(IF(K153=\"\",E152,K153*$F$3),E152)","v":0},{"$f":"IFERROR(D153*H153,F152)","v":""},{"$f":"IFERROR(IF(E153=\"\",G152,E153/$E$160),G152)","v":""},{"$f":"IFERROR(IF(L153=\"\",H152,L153/J153),H152)","v":""},"",{"$f":"J152","v":""},{"$f":"K152","v":""},{"$f":"L152","v":""}]
[]
["Baseline",{"$f":"'Cat 2 Setup'!A58","v":0},{"$f":"IFERROR(IF(AND(I155>$I$159,G155>$G$159),\"Star\",IF(AND(I155>$I$159,G155<$G$159),\"Puzzle\",IF(AND(I155<$I$159,G155>$G$159),\"Plow Horse\",\"Dog\"))),\"\")","v":"Dog"},{"$f":"IFERROR(VLOOKUP(B155,'Cat 2 Setup'!$A:$F,4,FALSE),\"\")","v":""},{"$f":"IFERROR(VLOOKUP(B155,'Cat 2 Setup'!$A:$F,3,FALSE),\"\")","v":0},{"$f":"IFERROR(VLOOKUP(B155,'Cat 2 Setup'!$A:$F,6,FALSE),\"\")","v":""},{"$f":"IFERROR(E155/$E$159,\"\")","v":""},{"$f":"IFERROR(F155/D155,\"\")","v":""},{"$f":"IFERROR(J155-L155,\"\")","v":""},{"$f":"IFERROR(D155/E155,\"\")","v":""},{"$f":"IFERROR(E155/$F$3,\"\")","v":""},{"$f":"IFERROR(J155*H155,\"\")","v":""}]
["Proposed",null,{"$f":"IFERROR(IF(AND(I156>$I$160,G156>$G$160),\"Star\",IF(AND(I156>$I$160,G156<$G$160),\"Puzzle\",IF(AND(I156<$I$160,G156>$G$160),\"Plow Horse\",\"Dog\"))),\"\")","v":"Dog"},{"$f":"IFERROR(IF(J156=\"\",D155,E156*J156),D155)","v":""},{"$f":"IFERROR(IF(K156=\"\",E155,K156*$F$3),E155)","v":0},{"$f":"IFERROR(D156*H156,F155)","v":""},{"$f":"IFERROR(IF(E156=\"\",G155,E156/$E$160),G155)","v":""},{"$f":"IFERROR(IF(L156=\"\",H155,L156/J156),H155)","v":""},"",{"$f":"J155","v":""},{"$f":"K155","v":""},{"$f":"L155","v":""}]
[]
[null,null,null,null,null,null,null,null,null,null,"(Items/Cover)"]
["Baseline","Total",null,{"$f":"IFERROR(SUMIF($A$8:$A$156,\"Baseline\",D$8:D$156),\"\")","v":0},{"$f":"IFERROR(SUMIF($A$8:$A$156,\"Baseline\",E$8:E$156),\"\")","v":0},{"$f":"IFERROR(SUMIF($A$8:$A$156,\"Baseline\",F$8:F$156),\"\")","v":0},{"$f":"IFERROR((AVERAGEIFS(G$8:G$156,$A$8:$A$156,\"Baseline\",G$8:G$156,\">0\")),\"\")","v":""},{"$f":"IFERROR(F159/D159,\"\")","v":""},{"$f":"IFERROR(AVERAGEIF($A$8:$A$156,\"Baseline\",I$8:I$156),\"\")","v":""},{"$f":"IFERROR(D159/E159,\"\")","v":""},{"$f":"IFERROR(E159/$F$3,\"\")","v":""},{"$f":"IFERROR(F159/E159,\"\")","v":""}]
["Proposed",null,null,{"$f":"IFERROR(SUMIF($A$8:$A$156,\"Proposed\",D$8:D$156),\"\")","v":0},{"$f":"IFERROR(SUMIF($A$8:$A$156,\"Proposed\",E$8:E$156),\"\")","v":0},{"$f":"IFERROR(SUMIF($A$8:$A$156,\"Proposed\",F$8:F$156),\"\")","v":0},{"$f":"IFERROR((AVERAGEIFS(G$8:G$156,$A$8:$A$156,\"Proposed\",G$8:G$156,\">0\")),\"\")","v":""},{"$f":"IFERROR(F160/D160,\"\")","v":""},{"$f":"IFERROR(AVERAGEIF($A$8:$A$156,\"Proposed\",I$8:I$156),\"\")","v":""},{"$f":"IFERROR(D160/E160,\"\")","v":""},{"$f":"IFERROR(E160/$F$3,\"\")","v":""},{"$f":"IFERROR(F160/E160,\"\")","v":""}]
[null,"%/BPs change",null,{"$f":"IFERROR((D160-D159)/D159,\"\")","v":""},{"$f":"IFERROR((E160-E159)/E159,\"\")","v":""},"",{"$f":"(G160-G159)*100","v":{"$error":"#VALUE!"}},{"$f":"(H160-H159)*100","v":{"$error":"#VALUE!"}},{"$f":"IFERROR((I160-I159)/I159,\"\")","v":""},"","",""]
[]
[]
[null,"Assumptions/Exclusions:"]
[]
[]
[]
[]
[]
[]
[null,"Admin Use:"]
[null,"CM (min):",{"$f":"ROUND(MIN(I8:I157),0)-5","v":-5},"Demand (max):",null,{"$f":"MIN(G8:G157)-0.05","v":-0.05}]
[null,"CM (max):",{"$f":"ROUND(MAX(I8:I157),0)+5","v":5},"Demand (min):",null,{"$f":"MAX(G8:G157)+0.05","v":0.05}]

{"sheet":"Cat 2 CM$ Chart","index":9,"n_rows":46,"n_cols":7,"rows_kept":46,"cut":false,"hidden":false,"merged":[[44,3,44,4],[45,3,45,4]]}
[{"$f":"CONCATENATE('Cat 2 CM$'!C1,\" \",'Cat 2 CM$'!C5,\" \",'Cat 2 CM$'!C4,\" - \",'Cat 2 CM$'!F5)","v":"0 0 0 - 0"}]
["Menu Enginnering Graph by Contribution Margin Dollars"]
[]
[]
[]
[]
[]
[]
[]
[]
[]
[]
[]
[]
[]
[]
[]
[]
[]
[]
[]
[]
[]
[]
[]
[]
[]
[]
[]
[]
[]
[]
[]
[]
[]
[]
[]
[]
[]
[]
[]
[]
[]
[null,null,null,null,null,"Low","High"]
[null,null,"X-AXIS -->","Menu Mix Parameters:",null,{"$f":"IFERROR(IF('Cat 2 CM$'!D8=\"\",\"\",MIN('Cat 2 CM$'!G8:G157)*0.9),\"\")","v":""},{"$f":"IFERROR(IF('Cat 2 CM$'!D8=\"\",\"\",MAX('Cat 2 CM$'!G8:G157)*1.1),\"\")","v":""}]
[null,null,"Y-AXIS -->","Contribution Margin:",null,{"$f":"IFERROR(IF('Cat 2 CM$'!D8=\"\",\"\",MIN('Cat 2 CM$'!$I$8:$I$157)*0.9),\"\")","v":""},{"$f":"IFERROR(IF('Cat 2 CM$'!D8=\"\",\"\",MAX('Cat 2 CM$'!$I$8:$I$157)*1.1),\"\")","v":""}]

{"sheet":"Cat 2 CM%","index":10,"n_rows":173,"n_cols":12,"rows_kept":173,"cut":false,"hidden":false,"merged":[[172,3,172,4],[133,1,134,1],[136,1,137,1],[139,1,140,1],[142,1,143,1],[145,1,146,1],[148,1,149,1],[151,1,152,1],[154,1,155,1],[158,1,159,2],[160,1,160,2],[171,3,171,4],[130,1,131,1],[97,1,98,1],[100,1,101,1],[103,1,104,1],[106,1,107,1],[109,1,110,1],[112,1,113,1],[115,1,116,1],[118,1,119,1],[121,1,122,1],[124,1,125,1],[127,1,128,1],[94,1,95,1],[61,1,62,1],[64,1,65,1],[67,1,68,1],[70,1,71,1],[73,1,74,1],[76,1,77,1],[79,1,80,1],[82,1,83,1],[85,1,86,1],[88,1,89,1],[91,1,92,1],[58,1,59,1],[25,1,26,1],[28,1,29,1],[31,1,32,1],[34,1,35,1],[37,1,38,1],[40,1,41,1],[43,1,44,1],[46,1,47,1],[49,1,50,1],[52,1,53,1],[55,1,56,1],[22,1,23,1],[7,1,8,1],[10,1,11,1],[13,1,14,1],[16,1,17,1],[19,1,20,1]]}
[null,"Restaurant Name",{"$f":"'Cat 2 Setup'!L1","v":0}]
[null,"Start Date:",{"$f":"'Cat 2 Setup'!L5","v":"00:00:00"},null,"Check Count:",{"$f":"'Cat 2 Setup'!N1","v":0}]
[null,"End Date",{"$f":"'Cat 2 Setup'!N5","v":"00:00:00"},null,"Cover Count:",{"$f":"'Cat 2 Setup'!N2","v":0}]
[null,"Meal Period:",{"$f":"'Cat 2 Setup'!L2","v":0},null,"Average Check:",{"$f":"'Cat 2 Setup'!N3","v":0}]
[null,"Revenue Center:",{"$f":"'Cat 2 Setup'!L3","v":0},null,"Menu Category",{"$f":"'Cat 2 Setup'!L4","v":0}]
[]
[null,"Item Name","Quadrant","Item Sales","Qty Sold","Food Cost","Menu Mix %","Item Cost %","Contribution Margin %","Item Price","Item/Cover%","Item Cost"]
["Baseline",{"$f":"'Cat 2 Setup'!A9","v":0},{"$f":"IFERROR(IF(AND(I8>$I$159,G8>$G$159),\"Star\",IF(AND(I8>$I$159,G8<$G$159),\"Puzzle\",IF(AND(I8<$I$159,G8>$G$159),\"Plow Horse\",\"Dog\"))),\"\")","v":"Dog"},{"$f":"IFERROR(VLOOKUP(B8,'Cat 2 Setup'!$A:$F,4,FALSE),\"\")","v":""},{"$f":"IFERROR(VLOOKUP(B8,'Cat 2 Setup'!$A:$F,3,FALSE),\"\")","v":0},{"$f":"IFERROR(VLOOKUP(B8,'Cat 2 Setup'!$A:$F,6,FALSE),\"\")","v":""},{"$f":"IFERROR(E8/$E$159,\"\")","v":""},{"$f":"IFERROR(F8/D8,\"\")","v":""},{"$f":"IFERROR((J8-L8)/J8,\"\")","v":""},{"$f":"IFERROR(D8/E8,\"\")","v":""},{"$f":"IFERROR(E8/$F$3,\"\")","v":""},{"$f":"IFERROR(J8*H8,\"\")","v":""}]
["Proposed",null,{"$f":"IFERROR(IF(AND(I9>$I$160,G9>$G$160),\"Star\",IF(AND(I9>$I$160,G9<$G$160),\"Puzzle\",IF(AND(I9<$I$160,G9>$G$160),\"Plow Horse\",\"Dog\"))),\"\")","v":"Dog"},{"$f":"IFERROR(IF(J9=\"\",D8,E9*J9),D8)","v":""},{"$f":"IFERROR(IF(K9=\"\",E8,K9*$F$3),E8)","v":0},{"$f":"IFERROR(D9*H9,F8)","v":""},{"$f":"IFERROR(IF(E9=\"\",G8,E9/$E$160),G8)","v":""},{"$f":"IFERROR(IF(L9=\"\",H8,L9/J9),H8)","v":""},{"$f":"IFERROR((J9-L9)/J9,\"\")","v":""},{"$f":"J8","v":""},{"$f":"K8","v":""},{"$f":"L8","v":""}]
[]
["Baseline",{"$f":"'Cat 2 Setup'!A10","v":0},{"$f":"IFERROR(IF(AND(I11>$I$159,G11>$G$159),\"Star\",IF(AND(I11>$I$159,G11<$G$159),\"Puzzle\",IF(AND(I11<$I$159,G11>$G$159),\"Plow Horse\",\"Dog\"))),\"\")","v":"Dog"},{"$f":"IFERROR(VLOOKUP(B11,'Cat 2 Setup'!$A:$F,4,FALSE),\"\")","v":""},{"$f":"IFERROR(VLOOKUP(B11,'Cat 2 Setup'!$A:$F,3,FALSE),\"\")","v":0},{"$f":"IFERROR(VLOOKUP(B11,'Cat 2 Setup'!$A:$F,6,FALSE),\"\")","v":""},{"$f":"IFERROR(E11/$E$159,\"\")","v":""},{"$f":"IFERROR(F11/D11,\"\")","v":""},{"$f":"IFERROR((J11-L11)/J11,\"\")","v":""},{"$f":"IFERROR(D11/E11,\"\")","v":""},{"$f":"IFERROR(E11/$F$3,\"\")","v":""},{"$f":"IFERROR(J11*H11,\"\")","v":""}]
["Proposed",null,{"$f":"IFERROR(IF(AND(I12>$I$160,G12>$G$160),\"Star\",IF(AND(I12>$I$160,G12<$G$160),\"Puzzle\",IF(AND(I12<$I$160,G12>$G$160),\"Plow Horse\",\"Dog\"))),\"\")","v":"Dog"},{"$f":"IFERROR(IF(J12=\"\",D11,E12*J12),D11)","v":""},{"$f":"IFERROR(IF(K12=\"\",E11,K12*$F$3),E11)","v":0},{"$f":"IFERROR(D12*H12,F11)","v":""},{"$f":"IFERROR(IF(E12=\"\",G11,E12/$E$160),G11)","v":""},{"$f":"IFERROR(IF(L12=\"\",H11,L12/J12),H11)","v":""},{"$f":"IFERROR((J12-L12)/J12,\"\")","v":""},{"$f":"J11","v":""},{"$f":"K11","v":""},{"$f":"L11","v":""}]
[]
["Baseline",{"$f":"'Cat 2 Setup'!A11","v":0},{"$f":"IFERROR(IF(AND(I14>$I$159,G14>$G$159),\"Star\",IF(AND(I14>$I$159,G14<$G$159),\"Puzzle\",IF(AND(I14<$I$159,G14>$G$159),\"Plow Horse\",\"Dog\"))),\"\")","v":"Dog"},{"$f":"IFERROR(VLOOKUP(B14,'Cat 2 Setup'!$A:$F,4,FALSE),\"\")","v":""},{"$f":"IFERROR(VLOOKUP(B14,'Cat 2 Setup'!$A:$F,3,FALSE),\"\")","v":0},{"$f":"IFERROR(VLOOKUP(B14,'Cat 2 Setup'!$A:$F,6,FALSE),\"\")","v":""},{"$f":"IFERROR(E14/$E$159,\"\")","v":""},{"$f":"IFERROR(F14/D14,\"\")","v":""},{"$f":"IFERROR((J14-L14)/J14,\"\")","v":""},{"$f":"IFERROR(D14/E14,\"\")","v":""},{"$f":"IFERROR(E14/$F$3,\"\")","v":""},{"$f":"IFERROR(J14*H14,\"\")","v":""}]
["Proposed",null,{"$f":"IFERROR(IF(AND(I15>$I$160,G15>$G$160),\"Star\",IF(AND(I15>$I$160,G15<$G$160),\"Puzzle\",IF(AND(I15<$I$160,G15>$G$160),\"Plow Horse\",\"Dog\"))),\"\")","v":"Dog"},{"$f":"IFERROR(IF(J15=\"\",D14,E15*J15),D14)","v":""},{"$f":"IFERROR(IF(K15=\"\",E14,K15*$F$3),E14)","v":0},{"$f":"IFERROR(D15*H15,F14)","v":""},{"$f":"IFERROR(IF(E15=\"\",G14,E15/$E$160),G14)","v":""},{"$f":"IFERROR(IF(L15=\"\",H14,L15/J15),H14)","v":""},{"$f":"IFERROR((J15-L15)/J15,\"\")","v":""},{"$f":"J14","v":""},{"$f":"K14","v":""},{"$f":"L14","v":""}]
[]
["Baseline",{"$f":"'Cat 2 Setup'!A12","v":0},{"$f":"IFERROR(IF(AND(I17>$I$159,G17>$G$159),\"Star\",IF(AND(I17>$I$159,G17<$G$159),\"Puzzle\",IF(AND(I17<$I$159,G17>$G$159),\"Plow Horse\",\"Dog\"))),\"\")","v":"Dog"},{"$f":"IFERROR(VLOOKUP(B17,'Cat 2 Setup'!$A:$F,4,FALSE),\"\")","v":""},{"$f":"IFERROR(VLOOKUP(B17,'Cat 2 Setup'!$A:$F,3,FALSE),\"\")","v":0},{"$f":"IFERROR(VLOOKUP(B17,'Cat 2 Setup'!$A:$F,6,FALSE),\"\")","v":""},{"$f":"IFERROR(E17/$E$159,\"\")","v":""},{"$f":"IFERROR(F17/D17,\"\")","v":""},{"$f":"IFERROR((J17-L17)/J17,\"\")","v":""},{"$f":"IFERROR(D17/E17,\"\")","v":""},{"$f":"IFERROR(E17/$F$3,\"\")","v":""},{"$f":"IFERROR(J17*H17,\"\")","v":""}]
["Proposed",null,{"$f":"IFERROR(IF(AND(I18>$I$160,G18>$G$160),\"Star\",IF(AND(I18>$I$160,G18<$G$160),\"Puzzle\",IF(AND(I18<$I$160,G18>$G$160),\"Plow Horse\",\"Dog\"))),\"\")","v":"Dog"},{"$f":"IFERROR(IF(J18=\"\",D17,E18*J18),D17)","v":""},{"$f":"IFERROR(IF(K18=\"\",E17,K18*$F$3),E17)","v":0},{"$f":"IFERROR(D18*H18,F17)","v":""},{"$f":"IFERROR(IF(E18=\"\",G17,E18/$E$160),G17)","v":""},{"$f":"IFERROR(IF(L18=\"\",H17,L18/J18),H17)","v":""},{"$f":"IFERROR((J18-L18)/J18,\"\")","v":""},{"$f":"J17","v":""},{"$f":"K17","v":""},{"$f":"L17","v":""}]
[]
["Baseline",{"$f":"'Cat 2 Setup'!A13","v":0},{"$f":"IFERROR(IF(AND(I20>$I$159,G20>$G$159),\"Star\",IF(AND(I20>$I$159,G20<$G$159),\"Puzzle\",IF(AND(I20<$I$159,G20>$G$159),\"Plow Horse\",\"Dog\"))),\"\")","v":"Dog"},{"$f":"IFERROR(VLOOKUP(B20,'Cat 2 Setup'!$A:$F,4,FALSE),\"\")","v":""},{"$f":"IFERROR(VLOOKUP(B20,'Cat 2 Setup'!$A:$F,3,FALSE),\"\")","v":0},{"$f":"IFERROR(VLOOKUP(B20,'Cat 2 Setup'!$A:$F,6,FALSE),\"\")","v":""},{"$f":"IFERROR(E20/$E$159,\"\")","v":""},{"$f":"IFERROR(F20/D20,\"\")","v":""},{"$f":"IFERROR((J20-L20)/J20,\"\")","v":""},{"$f":"IFERROR(D20/E20,\"\")","v":""},{"$f":"IFERROR(E20/$F$3,\"\")","v":""},{"$f":"IFERROR(J20*H20,\"\")","v":""}]
["Proposed",null,{"$f":"IFERROR(IF(AND(I21>$I$160,G21>$G$160),\"Star\",IF(AND(I21>$I$160,G21<$G$160),\"Puzzle\",IF(AND(I21<$I$160,G21>$G$160),\"Plow Horse\",\"Dog\"))),\"\")","v":"Dog"},{"$f":"IFERROR(IF(J21=\"\",D20,E21*J21),D20)","v":""},{"$f":"IFERROR(IF(K21=\"\",E20,K21*$F$3),E20)","v":0},{"$f":"IFERROR(D21*H21,F20)","v":""},{"$f":"IFERROR(IF(E21=\"\",G20,E21/$E$160),G20)","v":""},{"$f":"IFERROR(IF(L21=\"\",H20,L21/J21),H20)","v":""},{"$f":"IFERROR((J21-L21)/J21,\"\")","v":""},{"$f":"J20","v":""},{"$f":"K20","v":""},{"$f":"L20","v":""}]
[]
["Baseline",{"$f":"'Cat 2 Setup'!A14","v":0},{"$f":"IFERROR(IF(AND(I23>$I$159,G23>$G$159),\"Star\",IF(AND(I23>$I$159,G23<$G$159),\"Puzzle\",IF(AND(I23<$I$159,G23>$G$159),\"Plow Horse\",\"Dog\"))),\"\")","v":"Dog"},{"$f":"IFERROR(VLOOKUP(B23,'Cat 2 Setup'!$A:$F,4,FALSE),\"\")","v":""},{"$f":"IFERROR(VLOOKUP(B23,'Cat 2 Setup'!$A:$F,3,FALSE),\"\")","v":0},{"$f":"IFERROR(VLOOKUP(B23,'Cat 2 Setup'!$A:$F,6,FALSE),\"\")","v":""},{"$f":"IFERROR(E23/$E$159,\"\")","v":""},{"$f":"IFERROR(F23/D23,\"\")","v":""},{"$f":"IFERROR((J23-L23)/J23,\"\")","v":""},{"$f":"IFERROR(D23/E23,\"\")","v":""},{"$f":"IFERROR(E23/$F$3,\"\")","v":""},{"$f":"IFERROR(J23*H23,\"\")","v":""}]
["Proposed",null,{"$f":"IFERROR(IF(AND(I24>$I$160,G24>$G$160),\"Star\",IF(AND(I24>$I$160,G24<$G$160),\"Puzzle\",IF(AND(I24<$I$160,G24>$G$160),\"Plow Horse\",\"Dog\"))),\"\")","v":"Dog"},{"$f":"IFERROR(IF(J24=\"\",D23,E24*J24),D23)","v":""},{"$f":"IFERROR(IF(K24=\"\",E23,K24*$F$3),E23)","v":0},{"$f":"IFERROR(D24*H24,F23)","v":""},{"$f":"IFERROR(IF(E24=\"\",G23,E24/$E$160),G23)","v":""},{"$f":"IFERROR(IF(L24=\"\",H23,L24/J24),H23)","v":""},{"$f":"IFERROR((J24-L24)/J24,\"\")","v":""},{"$f":"J23","v":""},{"$f":"K23","v":""},{"$f":"L23","v":""}]
[]
["Baseline",{"$f":"'Cat 2 Setup'!A15","v":0},{"$f":"IFERROR(IF(AND(I26>$I$159,G26>$G$159),\"Star\",IF(AND(I26>$I$159,G26<$G$159),\"Puzzle\",IF(AND(I26<$I$159,G26>$G$159),\"Plow Horse\",\"Dog\"))),\"\")","v":"Dog"},{"$f":"IFERROR(VLOOKUP(B26,'Cat 2 Setup'!$A:$F,4,FALSE),\"\")","v":""},{"$f":"IFERROR(VLOOKUP(B26,'Cat 2 Setup'!$A:$F,3,FALSE),\"\")","v":0},{"$f":"IFERROR(VLOOKUP(B26,'Cat 2 Setup'!$A:$F,6,FALSE),\"\")","v":""},{"$f":"IFERROR(E26/$E$159,\"\")","v":""},{"$f":"IFERROR(F26/D26,\"\")","v":""},{"$f":"IFERROR((J26-L26)/J26,\"\")","v":""},{"$f":"IFERROR(D26/E26,\"\")","v":""},{"$f":"IFERROR(E26/$F$3,\"\")","v":""},{"$f":"IFERROR(J26*H26,\"\")","v":""}]
["Proposed",null,{"$f":"IFERROR(IF(AND(I27>$I$160,G27>$G$160),\"Star\",IF(AND(I27>$I$160,G27<$G$160),\"Puzzle\",IF(AND(I27<$I$160,G27>$G$160),\"Plow Horse\",\"Dog\"))),\"\")","v":"Dog"},{"$f":"IFERROR(IF(J27=\"\",D26,E27*J27),D26)","v":""},{"$f":"IFERROR(IF(K27=\"\",E26,K27*$F$3),E26)","v":0},{"$f":"IFERROR(D27*H27,F26)","v":""},{"$f":"IFERROR(IF(E27=\"\",G26,E27/$E$160),G26)","v":""},{"$f":"IFERROR(IF(L27=\"\",H26,L27/J27),H26)","v":""},{"$f":"IFERROR((J27-L27)/J27,\"\")","v":""},{"$f":"J26","v":""},{"$f":"K26","v":""},{"$f":"L26","v":""}]
[]
["Baseline",{"$f":"'Cat 2 Setup'!A16","v":0},{"$f":"IFERROR(IF(AND(I29>$I$159,G29>$G$159),\"Star\",IF(AND(I29>$I$159,G29<$G$159),\"Puzzle\",IF(AND(I29<$I$159,G29>$G$159),\"Plow Horse\",\"Dog\"))),\"\")","v":"Dog"},{"$f":"IFERROR(VLOOKUP(B29,'Cat 2 Setup'!$A:$F,4,FALSE),\"\")","v":""},{"$f":"IFERROR(VLOOKUP(B29,'Cat 2 Setup'!$A:$F,3,FALSE),\"\")","v":0},{"$f":"IFERROR(VLOOKUP(B29,'Cat 2 Setup'!$A:$F,6,FALSE),\"\")","v":""},{"$f":"IFERROR(E29/$E$159,\"\")","v":""},{"$f":"IFERROR(F29/D29,\"\")","v":""},{"$f":"IFERROR((J29-L29)/J29,\"\")","v":""},{"$f":"IFERROR(D29/E29,\"\")","v":""},{"$f":"IFERROR(E29/$F$3,\"\")","v":""},{"$f":"IFERROR(J29*H29,\"\")","v":""}]
["Proposed",null,{"$f":"IFERROR(IF(AND(I30>$I$160,G30>$G$160),\"Star\",IF(AND(I30>$I$160,G30<$G$160),\"Puzzle\",IF(AND(I30<$I$160,G30>$G$160),\"Plow Horse\",\"Dog\"))),\"\")","v":"Dog"},{"$f":"IFERROR(IF(J30=\"\",D29,E30*J30),D29)","v":""},{"$f":"IFERROR(IF(K30=\"\",E29,K30*$F$3),E29)","v":0},{"$f":"IFERROR(D30*H30,F29)","v":""},{"$f":"IFERROR(IF(E30=\"\",G29,E30/$E$160),G29)","v":""},{"$f":"IFERROR(IF(L30=\"\",H29,L30/J30),H29)","v":""},{"$f":"IFERROR((J30-L30)/J30,\"\")","v":""},{"$f":"J29","v":""},{"$f":"K29","v":""},{"$f":"L29","v":""}]
[]
["Baseline",{"$f":"'Cat 2 Setup'!A17","v":0},{"$f":"IFERROR(IF(AND(I32>$I$159,G32>$G$159),\"Star\",IF(AND(I32>$I$159,G32<$G$159),\"Puzzle\",IF(AND(I32<$I$159,G32>$G$159),\"Plow Horse\",\"Dog\"))),\"\")","v":"Dog"},{"$f":"IFERROR(VLOOKUP(B32,'Cat 2 Setup'!$A:$F,4,FALSE),\"\")","v":""},{"$f":"IFERROR(VLOOKUP(B32,'Cat 2 Setup'!$A:$F,3,FALSE),\"\")","v":0},{"$f":"IFERROR(VLOOKUP(B32,'Cat 2 Setup'!$A:$F,6,FALSE),\"\")","v":""},{"$f":"IFERROR(E32/$E$159,\"\")","v":""},{"$f":"IFERROR(F32/D32,\"\")","v":""},{"$f":"IFERROR((J32-L32)/J32,\"\")","v":""},{"$f":"IFERROR(D32/E32,\"\")","v":""},{"$f":"IFERROR(E32/$F$3,\"\")","v":""},{"$f":"IFERROR(J32*H32,\"\")","v":""}]
["Proposed",null,{"$f":"IFERROR(IF(AND(I33>$I$160,G33>$G$160),\"Star\",IF(AND(I33>$I$160,G33<$G$160),\"Puzzle\",IF(AND(I33<$I$160,G33>$G$160),\"Plow Horse\",\"Dog\"))),\"\")","v":"Dog"},{"$f":"IFERROR(IF(J33=\"\",D32,E33*J33),D32)","v":""},{"$f":"IFERROR(IF(K33=\"\",E32,K33*$F$3),E32)","v":0},{"$f":"IFERROR(D33*H33,F32)","v":""},{"$f":"IFERROR(IF(E33=\"\",G32,E33/$E$160),G32)","v":""},{"$f":"IFERROR(IF(L33=\"\",H32,L33/J33),H32)","v":""},{"$f":"IFERROR((J33-L33)/J33,\"\")","v":""},{"$f":"J32","v":""},{"$f":"K32","v":""},{"$f":"L32","v":""}]
[]
["Baseline",{"$f":"'Cat 2 Setup'!A18","v":0},{"$f":"IFERROR(IF(AND(I35>$I$159,G35>$G$159),\"Star\",IF(AND(I35>$I$159,G35<$G$159),\"Puzzle\",IF(AND(I35<$I$159,G35>$G$159),\"Plow Horse\",\"Dog\"))),\"\")","v":"Dog"},{"$f":"IFERROR(VLOOKUP(B35,'Cat 2 Setup'!$A:$F,4,FALSE),\"\")","v":""},{"$f":"IFERROR(VLOOKUP(B35,'Cat 2 Setup'!$A:$F,3,FALSE),\"\")","v":0},{"$f":"IFERROR(VLOOKUP(B35,'Cat 2 Setup'!$A:$F,6,FALSE),\"\")","v":""},{"$f":"IFERROR(E35/$E$159,\"\")","v":""},{"$f":"IFERROR(F35/D35,\"\")","v":""},{"$f":"IFERROR((J35-L35)/J35,\"\")","v":""},{"$f":"IFERROR(D35/E35,\"\")","v":""},{"$f":"IFERROR(E35/$F$3,\"\")","v":""},{"$f":"IFERROR(J35*H35,\"\")","v":""}]
["Proposed",null,{"$f":"IFERROR(IF(AND(I36>$I$160,G36>$G$160),\"Star\",IF(AND(I36>$I$160,G36<$G$160),\"Puzzle\",IF(AND(I36<$I$160,G36>$G$160),\"Plow Horse\",\"Dog\"))),\"\")","v":"Dog"},{"$f":"IFERROR(IF(J36=\"\",D35,E36*J36),D35)","v":""},{"$f":"IFERROR(IF(K36=\"\",E35,K36*$F$3),E35)","v":0},{"$f":"IFERROR(D36*H36,F35)","v":""},{"$f":"IFERROR(IF(E36=\"\",G35,E36/$E$160),G35)","v":""},{"$f":"IFERROR(IF(L36=\"\",H35,L36/J36),H35)","v":""},{"$f":"IFERROR((J36-L36)/J36,\"\")","v":""},{"$f":"J35","v":""},{"$f":"K35","v":""},{"$f":"L35","v":""}]
[]
["Baseline",{"$f":"'Cat 2 Setup'!A19","v":0},{"$f":"IFERROR(IF(AND(I38>$I$159,G38>$G$159),\"Star\",IF(AND(I38>$I$159,G38<$G$159),\"Puzzle\",IF(AND(I38<$I$159,G38>$G$159),\"Plow Horse\",\"Dog\"))),\"\")","v":"Dog"},{"$f":"IFERROR(VLOOKUP(B38,'Cat 2 Setup'!$A:$F,4,FALSE),\"\")","v":""},{"$f":"IFERROR(VLOOKUP(B38,'Cat 2 Setup'!$A:$F,3,FALSE),\"\")","v":0},{"$f":"IFERROR(VLOOKUP(B38,'Cat 2 Setup'!$A:$F,6,FALSE),\"\")","v":""},{"$f":"IFERROR(E38/$E$159,\"\")","v":""},{"$f":"IFERROR(F38/D38,\"\")","v":""},{"$f":"IFERROR((J38-L38)/J38,\"\")","v":""},{"$f":"IFERROR(D38/E38,\"\")","v":""},{"$f":"IFERROR(E38/$F$3,\"\")","v":""},{"$f":"IFERROR(J38*H38,\"\")","v":""}]
["Proposed",null,{"$f":"IFERROR(IF(AND(I39>$I$160,G39>$G$160),\"Star\",IF(AND(I39>$I$160,G39<$G$160),\"Puzzle\",IF(AND(I39<$I$160,G39>$G$160),\"Plow Horse\",\"Dog\"))),\"\")","v":"Dog"},{"$f":"IFERROR(IF(J39=\"\",D38,E39*J39),D38)","v":""},{"$f":"IFERROR(IF(K39=\"\",E38,K39*$F$3),E38)","v":0},{"$f":"IFERROR(D39*H39,F38)","v":""},{"$f":"IFERROR(IF(E39=\"\",G38,E39/$E$160),G38)","v":""},{"$f":"IFERROR(IF(L39=\"\",H38,L39/J39),H38)","v":""},{"$f":"IFERROR((J39-L39)/J39,\"\")","v":""},{"$f":"J38","v":""},{"$f":"K38","v":""},{"$f":"L38","v":""}]
[]
["Baseline",{"$f":"'Cat 2 Setup'!A20","v":0},{"$f":"IFERROR(IF(AND(I41>$I$159,G41>$G$159),\"Star\",IF(AND(I41>$I$159,G41<$G$159),\"Puzzle\",IF(AND(I41<$I$159,G41>$G$159),\"Plow Horse\",\"Dog\"))),\"\")","v":"Dog"},{"$f":"IFERROR(VLOOKUP(B41,'Cat 2 Setup'!$A:$F,4,FALSE),\"\")","v":""},{"$f":"IFERROR(VLOOKUP(B41,'Cat 2 Setup'!$A:$F,3,FALSE),\"\")","v":0},{"$f":"IFERROR(VLOOKUP(B41,'Cat 2 Setup'!$A:$F,6,FALSE),\"\")","v":""},{"$f":"IFERROR(E41/$E$159,\"\")","v":""},{"$f":"IFERROR(F41/D41,\"\")","v":""},{"$f":"IFERROR((J41-L41)/J41,\"\")","v":""},{"$f":"IFERROR(D41/E41,\"\")","v":""},{"$f":"IFERROR(E41/$F$3,\"\")","v":""},{"$f":"IFERROR(J41*H41,\"\")","v":""}]
["Proposed",null,{"$f":"IFERROR(IF(AND(I42>$I$160,G42>$G$160),\"Star\",IF(AND(I42>$I$160,G42<$G$160),\"Puzzle\",IF(AND(I42<$I$160,G42>$G$160),\"Plow Horse\",\"Dog\"))),\"\")","v":"Dog"},{"$f":"IFERROR(IF(J42=\"\",D41,E42*J42),D41)","v":""},{"$f":"IFERROR(IF(K42=\"\",E41,K42*$F$3),E41)","v":0},{"$f":"IFERROR(D42*H42,F41)","v":""},{"$f":"IFERROR(IF(E42=\"\",G41,E42/$E$160),G41)","v":""},{"$f":"IFERROR(IF(L42=\"\",H41,L42/J42),H41)","v":""},{"$f":"IFERROR((J42-L42)/J42,\"\")","v":""},{"$f":"J41","v":""},{"$f":"K41","v":""},{"$f":"L41","v":""}]
[]
["Baseline",{"$f":"'Cat 2 Setup'!A21","v":0},{"$f":"IFERROR(IF(AND(I44>$I$159,G44>$G$159),\"Star\",IF(AND(I44>$I$159,G44<$G$159),\"Puzzle\",IF(AND(I44<$I$159,G44>$G$159),\"Plow Horse\",\"Dog\"))),\"\")","v":"Dog"},{"$f":"IFERROR(VLOOKUP(B44,'Cat 2 Setup'!$A:$F,4,FALSE),\"\")","v":""},{"$f":"IFERROR(VLOOKUP(B44,'Cat 2 Setup'!$A:$F,3,FALSE),\"\")","v":0},{"$f":"IFERROR(VLOOKUP(B44,'Cat 2 Setup'!$A:$F,6,FALSE),\"\")","v":""},{"$f":"IFERROR(E44/$E$159,\"\")","v":""},{"$f":"IFERROR(F44/D44,\"\")","v":""},{"$f":"IFERROR((J44-L44)/J44,\"\")","v":""},{"$f":"IFERROR(D44/E44,\"\")","v":""},{"$f":"IFERROR(E44/$F$3,\"\")","v":""},{"$f":"IFERROR(J44*H44,\"\")","v":""}]
["Proposed",null,{"$f":"IFERROR(IF(AND(I45>$I$160,G45>$G$160),\"Star\",IF(AND(I45>$I$160,G45<$G$160),\"Puzzle\",IF(AND(I45<$I$160,G45>$G$160),\"Plow Horse\",\"Dog\"))),\"\")","v":"Dog"},{"$f":"IFERROR(IF(J45=\"\",D44,E45*J45),D44)","v":""},{"$f":"IFERROR(IF(K45=\"\",E44,K45*$F$3),E44)","v":0},{"$f":"IFERROR(D45*H45,F44)","v":""},{"$f":"IFERROR(IF(E45=\"\",G44,E45/$E$160),G44)","v":""},{"$f":"IFERROR(IF(L45=\"\",H44,L45/J45),H44)","v":""},{"$f":"IFERROR((J45-L45)/J45,\"\")","v":""},{"$f":"J44","v":""},{"$f":"K44","v":""},{"$f":"L44","v":""}]
[]
["Baseline",{"$f":"'Cat 2 Setup'!A22","v":0},{"$f":"IFERROR(IF(AND(I47>$I$159,G47>$G$159),\"Star\",IF(AND(I47>$I$159,G47<$G$159),\"Puzzle\",IF(AND(I47<$I$159,G47>$G$159),\"Plow Horse\",\"Dog\"))),\"\")","v":"Dog"},{"$f":"IFERROR(VLOOKUP(B47,'Cat 2 Setup'!$A:$F,4,FALSE),\"\")","v":""},{"$f":"IFERROR(VLOOKUP(B47,'Cat 2 Setup'!$A:$F,3,FALSE),\"\")","v":0},{"$f":"IFERROR(VLOOKUP(B47,'Cat 2 Setup'!$A:$F,6,FALSE),\"\")","v":""},{"$f":"IFERROR(E47/$E$159,\"\")","v":""},{"$f":"IFERROR(F47/D47,\"\")","v":""},{"$f":"IFERROR((J47-L47)/J47,\"\")","v":""},{"$f":"IFERROR(D47/E47,\"\")","v":""},{"$f":"IFERROR(E47/$F$3,\"\")","v":""},{"$f":"IFERROR(J47*H47,\"\")","v":""}]
["Proposed",null,{"$f":"IFERROR(IF(AND(I48>$I$160,G48>$G$160),\"Star\",IF(AND(I48>$I$160,G48<$G$160),\"Puzzle\",IF(AND(I48<$I$160,G48>$G$160),\"Plow Horse\",\"Dog\"))),\"\")","v":"Dog"},{"$f":"IFERROR(IF(J48=\"\",D47,E48*J48),D47)","v":""},{"$f":"IFERROR(IF(K48=\"\",E47,K48*$F$3),E47)","v":0},{"$f":"IFERROR(D48*H48,F47)","v":""},{"$f":"IFERROR(IF(E48=\"\",G47,E48/$E$160),G47)","v":""},{"$f":"IFERROR(IF(L48=\"\",H47,L48/J48),H47)","v":""},{"$f":"IFERROR((J48-L48)/J48,\"\")","v":""},{"$f":"J47","v":""},{"$f":"K47","v":""},{"$f":"L47","v":""}]
[]
["Baseline",{"$f":"'Cat 2 Setup'!A23","v":0},{"$f":"IFERROR(IF(AND(I50>$I$159,G50>$G$159),\"Star\",IF(AND(I50>$I$159,G50<$G$159),\"Puzzle\",IF(AND(I50<$I$159,G50>$G$159),\"Plow Horse\",\"Dog\"))),\"\")","v":"Dog"},{"$f":"IFERROR(VLOOKUP(B50,'Cat 2 Setup'!$A:$F,4,FALSE),\"\")","v":""},{"$f":"IFERROR(VLOOKUP(B50,'Cat 2 Setup'!$A:$F,3,FALSE),\"\")","v":0},{"$f":"IFERROR(VLOOKUP(B50,'Cat 2 Setup'!$A:$F,6,FALSE),\"\")","v":""},{"$f":"IFERROR(E50/$E$159,\"\")","v":""},{"$f":"IFERROR(F50/D50,\"\")","v":""},{"$f":"IFERROR((J50-L50)/J50,\"\")","v":""},{"$f":"IFERROR(D50/E50,\"\")","v":""},{"$f":"IFERROR(E50/$F$3,\"\")","v":""},{"$f":"IFERROR(J50*H50,\"\")","v":""}]
["Proposed",null,{"$f":"IFERROR(IF(AND(I51>$I$160,G51>$G$160),\"Star\",IF(AND(I51>$I$160,G51<$G$160),\"Puzzle\",IF(AND(I51<$I$160,G51>$G$160),\"Plow Horse\",\"Dog\"))),\"\")","v":"Dog"},{"$f":"IFERROR(IF(J51=\"\",D50,E51*J51),D50)","v":""},{"$f":"IFERROR(IF(K51=\"\",E50,K51*$F$3),E50)","v":0},{"$f":"IFERROR(D51*H51,F50)","v":""},{"$f":"IFERROR(IF(E51=\"\",G50,E51/$E$160),G50)","v":""},{"$f":"IFERROR(IF(L51=\"\",H50,L51/J51),H50)","v":""},{"$f":"IFERROR((J51-L51)/J51,\"\")","v":""},{"$f":"J50","v":""},{"$f":"K50","v":""},{"$f":"L50","v":""}]
[]
["Baseline",{"$f":"'Cat 2 Setup'!A24","v":0},{"$f":"IFERROR(IF(AND(I53>$I$159,G53>$G$159),\"Star\",IF(AND(I53>$I$159,G53<$G$159),\"Puzzle\",IF(AND(I53<$I$159,G53>$G$159),\"Plow Horse\",\"Dog\"))),\"\")","v":"Dog"},{"$f":"IFERROR(VLOOKUP(B53,'Cat 2 Setup'!$A:$F,4,FALSE),\"\")","v":""},{"$f":"IFERROR(VLOOKUP(B53,'Cat 2 Setup'!$A:$F,3,FALSE),\"\")","v":0},{"$f":"IFERROR(VLOOKUP(B53,'Cat 2 Setup'!$A:$F,6,FALSE),\"\")","v":""},{"$f":"IFERROR(E53/$E$159,\"\")","v":""},{"$f":"IFERROR(F53/D53,\"\")","v":""},{"$f":"IFERROR((J53-L53)/J53,\"\")","v":""},{"$f":"IFERROR(D53/E53,\"\")","v":""},{"$f":"IFERROR(E53/$F$3,\"\")","v":""},{"$f":"IFERROR(J53*H53,\"\")","v":""}]
["Proposed",null,{"$f":"IFERROR(IF(AND(I54>$I$160,G54>$G$160),\"Star\",IF(AND(I54>$I$160,G54<$G$160),\"Puzzle\",IF(AND(I54<$I$160,G54>$G$160),\"Plow Horse\",\"Dog\"))),\"\")","v":"Dog"},{"$f":"IFERROR(IF(J54=\"\",D53,E54*J54),D53)","v":""},{"$f":"IFERROR(IF(K54=\"\",E53,K54*$F$3),E53)","v":0},{"$f":"IFERROR(D54*H54,F53)","v":""},{"$f":"IFERROR(IF(E54=\"\",G53,E54/$E$160),G53)","v":""},{"$f":"IFERROR(IF(L54=\"\",H53,L54/J54),H53)","v":""},{"$f":"IFERROR((J54-L54)/J54,\"\")","v":""},{"$f":"J53","v":""},{"$f":"K53","v":""},{"$f":"L53","v":""}]
[]
["Baseline",{"$f":"'Cat 2 Setup'!A25","v":0},{"$f":"IFERROR(IF(AND(I56>$I$159,G56>$G$159),\"Star\",IF(AND(I56>$I$159,G56<$G$159),\"Puzzle\",IF(AND(I56<$I$159,G56>$G$159),\"Plow Horse\",\"Dog\"))),\"\")","v":"Dog"},{"$f":"IFERROR(VLOOKUP(B56,'Cat 2 Setup'!$A:$F,4,FALSE),\"\")","v":""},{"$f":"IFERROR(VLOOKUP(B56,'Cat 2 Setup'!$A:$F,3,FALSE),\"\")","v":0},{"$f":"IFERROR(VLOOKUP(B56,'Cat 2 Setup'!$A:$F,6,FALSE),\"\")","v":""},{"$f":"IFERROR(E56/$E$159,\"\")","v":""},{"$f":"IFERROR(F56/D56,\"\")","v":""},{"$f":"IFERROR((J56-L56)/J56,\"\")","v":""},{"$f":"IFERROR(D56/E56,\"\")","v":""},{"$f":"IFERROR(E56/$F$3,\"\")","v":""},{"$f":"IFERROR(J56*H56,\"\")","v":""}]
["Proposed",null,{"$f":"IFERROR(IF(AND(I57>$I$160,G57>$G$160),\"Star\",IF(AND(I57>$I$160,G57<$G$160),\"Puzzle\",IF(AND(I57<$I$160,G57>$G$160),\"Plow Horse\",\"Dog\"))),\"\")","v":"Dog"},{"$f":"IFERROR(IF(J57=\"\",D56,E57*J57),D56)","v":""},{"$f":"IFERROR(IF(K57=\"\",E56,K57*$F$3),E56)","v":0},{"$f":"IFERROR(D57*H57,F56)","v":""},{"$f":"IFERROR(IF(E57=\"\",G56,E57/$E$160),G56)","v":""},{"$f":"IFERROR(IF(L57=\"\",H56,L57/J57),H56)","v":""},{"$f":"IFERROR((J57-L57)/J57,\"\")","v":""},{"$f":"J56","v":""},{"$f":"K56","v":""},{"$f":"L56","v":""}]
[]
["Baseline",{"$f":"'Cat 2 Setup'!A26","v":0},{"$f":"IFERROR(IF(AND(I59>$I$159,G59>$G$159),\"Star\",IF(AND(I59>$I$159,G59<$G$159),\"Puzzle\",IF(AND(I59<$I$159,G59>$G$159),\"Plow Horse\",\"Dog\"))),\"\")","v":"Dog"},{"$f":"IFERROR(VLOOKUP(B59,'Cat 2 Setup'!$A:$F,4,FALSE),\"\")","v":""},{"$f":"IFERROR(VLOOKUP(B59,'Cat 2 Setup'!$A:$F,3,FALSE),\"\")","v":0},{"$f":"IFERROR(VLOOKUP(B59,'Cat 2 Setup'!$A:$F,6,FALSE),\"\")","v":""},{"$f":"IFERROR(E59/$E$159,\"\")","v":""},{"$f":"IFERROR(F59/D59,\"\")","v":""},{"$f":"IFERROR((J59-L59)/J59,\"\")","v":""},{"$f":"IFERROR(D59/E59,\"\")","v":""},{"$f":"IFERROR(E59/$F$3,\"\")","v":""},{"$f":"IFERROR(J59*H59,\"\")","v":""}]
["Proposed",null,{"$f":"IFERROR(IF(AND(I60>$I$160,G60>$G$160),\"Star\",IF(AND(I60>$I$160,G60<$G$160),\"Puzzle\",IF(AND(I60<$I$160,G60>$G$160),\"Plow Horse\",\"Dog\"))),\"\")","v":"Dog"},{"$f":"IFERROR(IF(J60=\"\",D59,E60*J60),D59)","v":""},{"$f":"IFERROR(IF(K60=\"\",E59,K60*$F$3),E59)","v":0},{"$f":"IFERROR(D60*H60,F59)","v":""},{"$f":"IFERROR(IF(E60=\"\",G59,E60/$E$160),G59)","v":""},{"$f":"IFERROR(IF(L60=\"\",H59,L60/J60),H59)","v":""},{"$f":"IFERROR((J60-L60)/J60,\"\")","v":""},{"$f":"J59","v":""},{"$f":"K59","v":""},{"$f":"L59","v":""}]
[]
["Baseline",{"$f":"'Cat 2 Setup'!A27","v":0},{"$f":"IFERROR(IF(AND(I62>$I$159,G62>$G$159),\"Star\",IF(AND(I62>$I$159,G62<$G$159),\"Puzzle\",IF(AND(I62<$I$159,G62>$G$159),\"Plow Horse\",\"Dog\"))),\"\")","v":"Dog"},{"$f":"IFERROR(VLOOKUP(B62,'Cat 2 Setup'!$A:$F,4,FALSE),\"\")","v":""},{"$f":"IFERROR(VLOOKUP(B62,'Cat 2 Setup'!$A:$F,3,FALSE),\"\")","v":0},{"$f":"IFERROR(VLOOKUP(B62,'Cat 2 Setup'!$A:$F,6,FALSE),\"\")","v":""},{"$f":"IFERROR(E62/$E$159,\"\")","v":""},{"$f":"IFERROR(F62/D62,\"\")","v":""},{"$f":"IFERROR((J62-L62)/J62,\"\")","v":""},{"$f":"IFERROR(D62/E62,\"\")","v":""},{"$f":"IFERROR(E62/$F$3,\"\")","v":""},{"$f":"IFERROR(J62*H62,\"\")","v":""}]
["Proposed",null,{"$f":"IFERROR(IF(AND(I63>$I$160,G63>$G$160),\"Star\",IF(AND(I63>$I$160,G63<$G$160),\"Puzzle\",IF(AND(I63<$I$160,G63>$G$160),\"Plow Horse\",\"Dog\"))),\"\")","v":"Dog"},{"$f":"IFERROR(IF(J63=\"\",D62,E63*J63),D62)","v":""},{"$f":"IFERROR(IF(K63=\"\",E62,K63*$F$3),E62)","v":0},{"$f":"IFERROR(D63*H63,F62)","v":""},{"$f":"IFERROR(IF(E63=\"\",G62,E63/$E$160),G62)","v":""},{"$f":"IFERROR(IF(L63=\"\",H62,L63/J63),H62)","v":""},{"$f":"IFERROR((J63-L63)/J63,\"\")","v":""},{"$f":"J62","v":""},{"$f":"K62","v":""},{"$f":"L62","v":""}]
[]
["Baseline",{"$f":"'Cat 2 Setup'!A28","v":0},{"$f":"IFERROR(IF(AND(I65>$I$159,G65>$G$159),\"Star\",IF(AND(I65>$I$159,G65<$G$159),\"Puzzle\",IF(AND(I65<$I$159,G65>$G$159),\"Plow Horse\",\"Dog\"))),\"\")","v":"Dog"},{"$f":"IFERROR(VLOOKUP(B65,'Cat 2 Setup'!$A:$F,4,FALSE),\"\")","v":""},{"$f":"IFERROR(VLOOKUP(B65,'Cat 2 Setup'!$A:$F,3,FALSE),\"\")","v":0},{"$f":"IFERROR(VLOOKUP(B65,'Cat 2 Setup'!$A:$F,6,FALSE),\"\")","v":""},{"$f":"IFERROR(E65/$E$159,\"\")","v":""},{"$f":"IFERROR(F65/D65,\"\")","v":""},{"$f":"IFERROR((J65-L65)/J65,\"\")","v":""},{"$f":"IFERROR(D65/E65,\"\")","v":""},{"$f":"IFERROR(E65/$F$3,\"\")","v":""},{"$f":"IFERROR(J65*H65,\"\")","v":""}]
["Proposed",null,{"$f":"IFERROR(IF(AND(I66>$I$160,G66>$G$160),\"Star\",IF(AND(I66>$I$160,G66<$G$160),\"Puzzle\",IF(AND(I66<$I$160,G66>$G$160),\"Plow Horse\",\"Dog\"))),\"\")","v":"Dog"},{"$f":"IFERROR(IF(J66=\"\",D65,E66*J66),D65)","v":""},{"$f":"IFERROR(IF(K66=\"\",E65,K66*$F$3),E65)","v":0},{"$f":"IFERROR(D66*H66,F65)","v":""},{"$f":"IFERROR(IF(E66=\"\",G65,E66/$E$160),G65)","v":""},{"$f":"IFERROR(IF(L66=\"\",H65,L66/J66),H65)","v":""},{"$f":"IFERROR((J66-L66)/J66,\"\")","v":""},{"$f":"J65","v":""},{"$f":"K65","v":""},{"$f":"L65","v":""}]
[]
["Baseline",{"$f":"'Cat 2 Setup'!A29","v":0},{"$f":"IFERROR(IF(AND(I68>$I$159,G68>$G$159),\"Star\",IF(AND(I68>$I$159,G68<$G$159),\"Puzzle\",IF(AND(I68<$I$159,G68>$G$159),\"Plow Horse\",\"Dog\"))),\"\")","v":"Dog"},{"$f":"IFERROR(VLOOKUP(B68,'Cat 2 Setup'!$A:$F,4,FALSE),\"\")","v":""},{"$f":"IFERROR(VLOOKUP(B68,'Cat 2 Setup'!$A:$F,3,FALSE),\"\")","v":0},{"$f":"IFERROR(VLOOKUP(B68,'Cat 2 Setup'!$A:$F,6,FALSE),\"\")","v":""},{"$f":"IFERROR(E68/$E$159,\"\")","v":""},{"$f":"IFERROR(F68/D68,\"\")","v":""},{"$f":"IFERROR((J68-L68)/J68,\"\")","v":""},{"$f":"IFERROR(D68/E68,\"\")","v":""},{"$f":"IFERROR(E68/$F$3,\"\")","v":""},{"$f":"IFERROR(J68*H68,\"\")","v":""}]
["Proposed",null,{"$f":"IFERROR(IF(AND(I69>$I$160,G69>$G$160),\"Star\",IF(AND(I69>$I$160,G69<$G$160),\"Puzzle\",IF(AND(I69<$I$160,G69>$G$160),\"Plow Horse\",\"Dog\"))),\"\")","v":"Dog"},{"$f":"IFERROR(IF(J69=\"\",D68,E69*J69),D68)","v":""},{"$f":"IFERROR(IF(K69=\"\",E68,K69*$F$3),E68)","v":0},{"$f":"IFERROR(D69*H69,F68)","v":""},{"$f":"IFERROR(IF(E69=\"\",G68,E69/$E$160),G68)","v":""},{"$f":"IFERROR(IF(L69=\"\",H68,L69/J69),H68)","v":""},{"$f":"IFERROR((J69-L69)/J69,\"\")","v":""},{"$f":"J68","v":""},{"$f":"K68","v":""},{"$f":"L68","v":""}]
[]
["Baseline",{"$f":"'Cat 2 Setup'!A30","v":0},{"$f":"IFERROR(IF(AND(I71>$I$159,G71>$G$159),\"Star\",IF(AND(I71>$I$159,G71<$G$159),\"Puzzle\",IF(AND(I71<$I$159,G71>$G$159),\"Plow Horse\",\"Dog\"))),\"\")","v":"Dog"},{"$f":"IFERROR(VLOOKUP(B71,'Cat 2 Setup'!$A:$F,4,FALSE),\"\")","v":""},{"$f":"IFERROR(VLOOKUP(B71,'Cat 2 Setup'!$A:$F,3,FALSE),\"\")","v":0},{"$f":"IFERROR(VLOOKUP(B71,'Cat 2 Setup'!$A:$F,6,FALSE),\"\")","v":""},{"$f":"IFERROR(E71/$E$159,\"\")","v":""},{"$f":"IFERROR(F71/D71,\"\")","v":""},{"$f":"IFERROR((J71-L71)/J71,\"\")","v":""},{"$f":"IFERROR(D71/E71,\"\")","v":""},{"$f":"IFERROR(E71/$F$3,\"\")","v":""},{"$f":"IFERROR(J71*H71,\"\")","v":""}]
["Proposed",null,{"$f":"IFERROR(IF(AND(I72>$I$160,G72>$G$160),\"Star\",IF(AND(I72>$I$160,G72<$G$160),\"Puzzle\",IF(AND(I72<$I$160,G72>$G$160),\"Plow Horse\",\"Dog\"))),\"\")","v":"Dog"},{"$f":"IFERROR(IF(J72=\"\",D71,E72*J72),D71)","v":""},{"$f":"IFERROR(IF(K72=\"\",E71,K72*$F$3),E71)","v":0},{"$f":"IFERROR(D72*H72,F71)","v":""},{"$f":"IFERROR(IF(E72=\"\",G71,E72/$E$160),G71)","v":""},{"$f":"IFERROR(IF(L72=\"\",H71,L72/J72),H71)","v":""},{"$f":"IFERROR((J72-L72)/J72,\"\")","v":""},{"$f":"J71","v":""},{"$f":"K71","v":""},{"$f":"L71","v":""}]
[]
["Baseline",{"$f":"'Cat 2 Setup'!A31","v":0},{"$f":"IFERROR(IF(AND(I74>$I$159,G74>$G$159),\"Star\",IF(AND(I74>$I$159,G74<$G$159),\"Puzzle\",IF(AND(I74<$I$159,G74>$G$159),\"Plow Horse\",\"Dog\"))),\"\")","v":"Dog"},{"$f":"IFERROR(VLOOKUP(B74,'Cat 2 Setup'!$A:$F,4,FALSE),\"\")","v":""},{"$f":"IFERROR(VLOOKUP(B74,'Cat 2 Setup'!$A:$F,3,FALSE),\"\")","v":0},{"$f":"IFERROR(VLOOKUP(B74,'Cat 2 Setup'!$A:$F,6,FALSE),\"\")","v":""},{"$f":"IFERROR(E74/$E$159,\"\")","v":""},{"$f":"IFERROR(F74/D74,\"\")","v":""},{"$f":"IFERROR((J74-L74)/J74,\"\")","v":""},{"$f":"IFERROR(D74/E74,\"\")","v":""},{"$f":"IFERROR(E74/$F$3,\"\")","v":""},{"$f":"IFERROR(J74*H74,\"\")","v":""}]
["Proposed",null,{"$f":"IFERROR(IF(AND(I75>$I$160,G75>$G$160),\"Star\",IF(AND(I75>$I$160,G75<$G$160),\"Puzzle\",IF(AND(I75<$I$160,G75>$G$160),\"Plow Horse\",\"Dog\"))),\"\")","v":"Dog"},{"$f":"IFERROR(IF(J75=\"\",D74,E75*J75),D74)","v":""},{"$f":"IFERROR(IF(K75=\"\",E74,K75*$F$3),E74)","v":0},{"$f":"IFERROR(D75*H75,F74)","v":""},{"$f":"IFERROR(IF(E75=\"\",G74,E75/$E$160),G74)","v":""},{"$f":"IFERROR(IF(L75=\"\",H74,L75/J75),H74)","v":""},{"$f":"IFERROR((J75-L75)/J75,\"\")","v":""},{"$f":"J74","v":""},{"$f":"K74","v":""},{"$f":"L74","v":""}]
[]
["Baseline",{"$f":"'Cat 2 Setup'!A32","v":0},{"$f":"IFERROR(IF(AND(I77>$I$159,G77>$G$159),\"Star\",IF(AND(I77>$I$159,G77<$G$159),\"Puzzle\",IF(AND(I77<$I$159,G77>$G$159),\"Plow Horse\",\"Dog\"))),\"\")","v":"Dog"},{"$f":"IFERROR(VLOOKUP(B77,'Cat 2 Setup'!$A:$F,4,FALSE),\"\")","v":""},{"$f":"IFERROR(VLOOKUP(B77,'Cat 2 Setup'!$A:$F,3,FALSE),\"\")","v":0},{"$f":"IFERROR(VLOOKUP(B77,'Cat 2 Setup'!$A:$F,6,FALSE),\"\")","v":""},{"$f":"IFERROR(E77/$E$159,\"\")","v":""},{"$f":"IFERROR(F77/D77,\"\")","v":""},{"$f":"IFERROR((J77-L77)/J77,\"\")","v":""},{"$f":"IFERROR(D77/E77,\"\")","v":""},{"$f":"IFERROR(E77/$F$3,\"\")","v":""},{"$f":"IFERROR(J77*H77,\"\")","v":""}]
["Proposed",null,{"$f":"IFERROR(IF(AND(I78>$I$160,G78>$G$160),\"Star\",IF(AND(I78>$I$160,G78<$G$160),\"Puzzle\",IF(AND(I78<$I$160,G78>$G$160),\"Plow Horse\",\"Dog\"))),\"\")","v":"Dog"},{"$f":"IFERROR(IF(J78=\"\",D77,E78*J78),D77)","v":""},{"$f":"IFERROR(IF(K78=\"\",E77,K78*$F$3),E77)","v":0},{"$f":"IFERROR(D78*H78,F77)","v":""},{"$f":"IFERROR(IF(E78=\"\",G77,E78/$E$160),G77)","v":""},{"$f":"IFERROR(IF(L78=\"\",H77,L78/J78),H77)","v":""},{"$f":"IFERROR((J78-L78)/J78,\"\")","v":""},{"$f":"J77","v":""},{"$f":"K77","v":""},{"$f":"L77","v":""}]
[]
["Baseline",{"$f":"'Cat 2 Setup'!A33","v":0},{"$f":"IFERROR(IF(AND(I80>$I$159,G80>$G$159),\"Star\",IF(AND(I80>$I$159,G80<$G$159),\"Puzzle\",IF(AND(I80<$I$159,G80>$G$159),\"Plow Horse\",\"Dog\"))),\"\")","v":"Dog"},{"$f":"IFERROR(VLOOKUP(B80,'Cat 2 Setup'!$A:$F,4,FALSE),\"\")","v":""},{"$f":"IFERROR(VLOOKUP(B80,'Cat 2 Setup'!$A:$F,3,FALSE),\"\")","v":0},{"$f":"IFERROR(VLOOKUP(B80,'Cat 2 Setup'!$A:$F,6,FALSE),\"\")","v":""},{"$f":"IFERROR(E80/$E$159,\"\")","v":""},{"$f":"IFERROR(F80/D80,\"\")","v":""},{"$f":"IFERROR((J80-L80)/J80,\"\")","v":""},{"$f":"IFERROR(D80/E80,\"\")","v":""},{"$f":"IFERROR(E80/$F$3,\"\")","v":""},{"$f":"IFERROR(J80*H80,\"\")","v":""}]
["Proposed",null,{"$f":"IFERROR(IF(AND(I81>$I$160,G81>$G$160),\"Star\",IF(AND(I81>$I$160,G81<$G$160),\"Puzzle\",IF(AND(I81<$I$160,G81>$G$160),\"Plow Horse\",\"Dog\"))),\"\")","v":"Dog"},{"$f":"IFERROR(IF(J81=\"\",D80,E81*J81),D80)","v":""},{"$f":"IFERROR(IF(K81=\"\",E80,K81*$F$3),E80)","v":0},{"$f":"IFERROR(D81*H81,F80)","v":""},{"$f":"IFERROR(IF(E81=\"\",G80,E81/$E$160),G80)","v":""},{"$f":"IFERROR(IF(L81=\"\",H80,L81/J81),H80)","v":""},{"$f":"IFERROR((J81-L81)/J81,\"\")","v":""},{"$f":"J80","v":""},{"$f":"K80","v":""},{"$f":"L80","v":""}]
[]
["Baseline",{"$f":"'Cat 2 Setup'!A34","v":0},{"$f":"IFERROR(IF(AND(I83>$I$159,G83>$G$159),\"Star\",IF(AND(I83>$I$159,G83<$G$159),\"Puzzle\",IF(AND(I83<$I$159,G83>$G$159),\"Plow Horse\",\"Dog\"))),\"\")","v":"Dog"},{"$f":"IFERROR(VLOOKUP(B83,'Cat 2 Setup'!$A:$F,4,FALSE),\"\")","v":""},{"$f":"IFERROR(VLOOKUP(B83,'Cat 2 Setup'!$A:$F,3,FALSE),\"\")","v":0},{"$f":"IFERROR(VLOOKUP(B83,'Cat 2 Setup'!$A:$F,6,FALSE),\"\")","v":""},{"$f":"IFERROR(E83/$E$159,\"\")","v":""},{"$f":"IFERROR(F83/D83,\"\")","v":""},{"$f":"IFERROR((J83-L83)/J83,\"\")","v":""},{"$f":"IFERROR(D83/E83,\"\")","v":""},{"$f":"IFERROR(E83/$F$3,\"\")","v":""},{"$f":"IFERROR(J83*H83,\"\")","v":""}]
["Proposed",null,{"$f":"IFERROR(IF(AND(I84>$I$160,G84>$G$160),\"Star\",IF(AND(I84>$I$160,G84<$G$160),\"Puzzle\",IF(AND(I84<$I$160,G84>$G$160),\"Plow Horse\",\"Dog\"))),\"\")","v":"Dog"},{"$f":"IFERROR(IF(J84=\"\",D83,E84*J84),D83)","v":""},{"$f":"IFERROR(IF(K84=\"\",E83,K84*$F$3),E83)","v":0},{"$f":"IFERROR(D84*H84,F83)","v":""},{"$f":"IFERROR(IF(E84=\"\",G83,E84/$E$160),G83)","v":""},{"$f":"IFERROR(IF(L84=\"\",H83,L84/J84),H83)","v":""},{"$f":"IFERROR((J84-L84)/J84,\"\")","v":""},{"$f":"J83","v":""},{"$f":"K83","v":""},{"$f":"L83","v":""}]
[]
["Baseline",{"$f":"'Cat 2 Setup'!A35","v":0},{"$f":"IFERROR(IF(AND(I86>$I$159,G86>$G$159),\"Star\",IF(AND(I86>$I$159,G86<$G$159),\"Puzzle\",IF(AND(I86<$I$159,G86>$G$159),\"Plow Horse\",\"Dog\"))),\"\")","v":"Dog"},{"$f":"IFERROR(VLOOKUP(B86,'Cat 2 Setup'!$A:$F,4,FALSE),\"\")","v":""},{"$f":"IFERROR(VLOOKUP(B86,'Cat 2 Setup'!$A:$F,3,FALSE),\"\")","v":0},{"$f":"IFERROR(VLOOKUP(B86,'Cat 2 Setup'!$A:$F,6,FALSE),\"\")","v":""},{"$f":"IFERROR(E86/$E$159,\"\")","v":""},{"$f":"IFERROR(F86/D86,\"\")","v":""},{"$f":"IFERROR((J86-L86)/J86,\"\")","v":""},{"$f":"IFERROR(D86/E86,\"\")","v":""},{"$f":"IFERROR(E86/$F$3,\"\")","v":""},{"$f":"IFERROR(J86*H86,\"\")","v":""}]
["Proposed",null,{"$f":"IFERROR(IF(AND(I87>$I$160,G87>$G$160),\"Star\",IF(AND(I87>$I$160,G87<$G$160),\"Puzzle\",IF(AND(I87<$I$160,G87>$G$160),\"Plow Horse\",\"Dog\"))),\"\")","v":"Dog"},{"$f":"IFERROR(IF(J87=\"\",D86,E87*J87),D86)","v":""},{"$f":"IFERROR(IF(K87=\"\",E86,K87*$F$3),E86)","v":0},{"$f":"IFERROR(D87*H87,F86)","v":""},{"$f":"IFERROR(IF(E87=\"\",G86,E87/$E$160),G86)","v":""},{"$f":"IFERROR(IF(L87=\"\",H86,L87/J87),H86)","v":""},{"$f":"IFERROR((J87-L87)/J87,\"\")","v":""},{"$f":"J86","v":""},{"$f":"K86","v":""},{"$f":"L86","v":""}]
[]
["Baseline",{"$f":"'Cat 2 Setup'!A36","v":0},{"$f":"IFERROR(IF(AND(I89>$I$159,G89>$G$159),\"Star\",IF(AND(I89>$I$159,G89<$G$159),\"Puzzle\",IF(AND(I89<$I$159,G89>$G$159),\"Plow Horse\",\"Dog\"))),\"\")","v":"Dog"},{"$f":"IFERROR(VLOOKUP(B89,'Cat 2 Setup'!$A:$F,4,FALSE),\"\")","v":""},{"$f":"IFERROR(VLOOKUP(B89,'Cat 2 Setup'!$A:$F,3,FALSE),\"\")","v":0},{"$f":"IFERROR(VLOOKUP(B89,'Cat 2 Setup'!$A:$F,6,FALSE),\"\")","v":""},{"$f":"IFERROR(E89/$E$159,\"\")","v":""},{"$f":"IFERROR(F89/D89,\"\")","v":""},{"$f":"IFERROR((J89-L89)/J89,\"\")","v":""},{"$f":"IFERROR(D89/E89,\"\")","v":""},{"$f":"IFERROR(E89/$F$3,\"\")","v":""},{"$f":"IFERROR(J89*H89,\"\")","v":""}]
["Proposed",null,{"$f":"IFERROR(IF(AND(I90>$I$160,G90>$G$160),\"Star\",IF(AND(I90>$I$160,G90<$G$160),\"Puzzle\",IF(AND(I90<$I$160,G90>$G$160),\"Plow Horse\",\"Dog\"))),\"\")","v":"Dog"},{"$f":"IFERROR(IF(J90=\"\",D89,E90*J90),D89)","v":""},{"$f":"IFERROR(IF(K90=\"\",E89,K90*$F$3),E89)","v":0},{"$f":"IFERROR(D90*H90,F89)","v":""},{"$f":"IFERROR(IF(E90=\"\",G89,E90/$E$160),G89)","v":""},{"$f":"IFERROR(IF(L90=\"\",H89,L90/J90),H89)","v":""},{"$f":"IFERROR((J90-L90)/J90,\"\")","v":""},{"$f":"J89","v":""},{"$f":"K89","v":""},{"$f":"L89","v":""}]
[]
["Baseline",{"$f":"'Cat 2 Setup'!A37","v":0},{"$f":"IFERROR(IF(AND(I92>$I$159,G92>$G$159),\"Star\",IF(AND(I92>$I$159,G92<$G$159),\"Puzzle\",IF(AND(I92<$I$159,G92>$G$159),\"Plow Horse\",\"Dog\"))),\"\")","v":"Dog"},{"$f":"IFERROR(VLOOKUP(B92,'Cat 2 Setup'!$A:$F,4,FALSE),\"\")","v":""},{"$f":"IFERROR(VLOOKUP(B92,'Cat 2 Setup'!$A:$F,3,FALSE),\"\")","v":0},{"$f":"IFERROR(VLOOKUP(B92,'Cat 2 Setup'!$A:$F,6,FALSE),\"\")","v":""},{"$f":"IFERROR(E92/$E$159,\"\")","v":""},{"$f":"IFERROR(F92/D92,\"\")","v":""},{"$f":"IFERROR((J92-L92)/J92,\"\")","v":""},{"$f":"IFERROR(D92/E92,\"\")","v":""},{"$f":"IFERROR(E92/$F$3,\"\")","v":""},{"$f":"IFERROR(J92*H92,\"\")","v":""}]
["Proposed",null,{"$f":"IFERROR(IF(AND(I93>$I$160,G93>$G$160),\"Star\",IF(AND(I93>$I$160,G93<$G$160),\"Puzzle\",IF(AND(I93<$I$160,G93>$G$160),\"Plow Horse\",\"Dog\"))),\"\")","v":"Dog"},{"$f":"IFERROR(IF(J93=\"\",D92,E93*J93),D92)","v":""},{"$f":"IFERROR(IF(K93=\"\",E92,K93*$F$3),E92)","v":0},{"$f":"IFERROR(D93*H93,F92)","v":""},{"$f":"IFERROR(IF(E93=\"\",G92,E93/$E$160),G92)","v":""},{"$f":"IFERROR(IF(L93=\"\",H92,L93/J93),H92)","v":""},{"$f":"IFERROR((J93-L93)/J93,\"\")","v":""},{"$f":"J92","v":""},{"$f":"K92","v":""},{"$f":"L92","v":""}]
[]
["Baseline",{"$f":"'Cat 2 Setup'!A38","v":0},{"$f":"IFERROR(IF(AND(I95>$I$159,G95>$G$159),\"Star\",IF(AND(I95>$I$159,G95<$G$159),\"Puzzle\",IF(AND(I95<$I$159,G95>$G$159),\"Plow Horse\",\"Dog\"))),\"\")","v":"Dog"},{"$f":"IFERROR(VLOOKUP(B95,'Cat 2 Setup'!$A:$F,4,FALSE),\"\")","v":""},{"$f":"IFERROR(VLOOKUP(B95,'Cat 2 Setup'!$A:$F,3,FALSE),\"\")","v":0},{"$f":"IFERROR(VLOOKUP(B95,'Cat 2 Setup'!$A:$F,6,FALSE),\"\")","v":""},{"$f":"IFERROR(E95/$E$159,\"\")","v":""},{"$f":"IFERROR(F95/D95,\"\")","v":""},{"$f":"IFERROR((J95-L95)/J95,\"\")","v":""},{"$f":"IFERROR(D95/E95,\"\")","v":""},{"$f":"IFERROR(E95/$F$3,\"\")","v":""},{"$f":"IFERROR(J95*H95,\"\")","v":""}]
["Proposed",null,{"$f":"IFERROR(IF(AND(I96>$I$160,G96>$G$160),\"Star\",IF(AND(I96>$I$160,G96<$G$160),\"Puzzle\",IF(AND(I96<$I$160,G96>$G$160),\"Plow Horse\",\"Dog\"))),\"\")","v":"Dog"},{"$f":"IFERROR(IF(J96=\"\",D95,E96*J96),D95)","v":""},{"$f":"IFERROR(IF(K96=\"\",E95,K96*$F$3),E95)","v":0},{"$f":"IFERROR(D96*H96,F95)","v":""},{"$f":"IFERROR(IF(E96=\"\",G95,E96/$E$160),G95)","v":""},{"$f":"IFERROR(IF(L96=\"\",H95,L96/J96),H95)","v":""},{"$f":"IFERROR((J96-L96)/J96,\"\")","v":""},{"$f":"J95","v":""},{"$f":"K95","v":""},{"$f":"L95","v":""}]
[]
["Baseline",{"$f":"'Cat 2 Setup'!A39","v":0},{"$f":"IFERROR(IF(AND(I98>$I$159,G98>$G$159),\"Star\",IF(AND(I98>$I$159,G98<$G$159),\"Puzzle\",IF(AND(I98<$I$159,G98>$G$159),\"Plow Horse\",\"Dog\"))),\"\")","v":"Dog"},{"$f":"IFERROR(VLOOKUP(B98,'Cat 2 Setup'!$A:$F,4,FALSE),\"\")","v":""},{"$f":"IFERROR(VLOOKUP(B98,'Cat 2 Setup'!$A:$F,3,FALSE),\"\")","v":0},{"$f":"IFERROR(VLOOKUP(B98,'Cat 2 Setup'!$A:$F,6,FALSE),\"\")","v":""},{"$f":"IFERROR(E98/$E$159,\"\")","v":""},{"$f":"IFERROR(F98/D98,\"\")","v":""},{"$f":"IFERROR((J98-L98)/J98,\"\")","v":""},{"$f":"IFERROR(D98/E98,\"\")","v":""},{"$f":"IFERROR(E98/$F$3,\"\")","v":""},{"$f":"IFERROR(J98*H98,\"\")","v":""}]
["Proposed",null,{"$f":"IFERROR(IF(AND(I99>$I$160,G99>$G$160),\"Star\",IF(AND(I99>$I$160,G99<$G$160),\"Puzzle\",IF(AND(I99<$I$160,G99>$G$160),\"Plow Horse\",\"Dog\"))),\"\")","v":"Dog"},{"$f":"IFERROR(IF(J99=\"\",D98,E99*J99),D98)","v":""},{"$f":"IFERROR(IF(K99=\"\",E98,K99*$F$3),E98)","v":0},{"$f":"IFERROR(D99*H99,F98)","v":""},{"$f":"IFERROR(IF(E99=\"\",G98,E99/$E$160),G98)","v":""},{"$f":"IFERROR(IF(L99=\"\",H98,L99/J99),H98)","v":""},{"$f":"IFERROR((J99-L99)/J99,\"\")","v":""},{"$f":"J98","v":""},{"$f":"K98","v":""},{"$f":"L98","v":""}]
[null,null,null,null,null,null,{"$f":"(1/COUNTA(B8:B96))*0.7","v":2.3333333333333331E-2}]
["Baseline",{"$f":"'Cat 2 Setup'!A40","v":0},{"$f":"IFERROR(IF(AND(I101>$I$159,G101>$G$159),\"Star\",IF(AND(I101>$I$159,G101<$G$159),\"Puzzle\",IF(AND(I101<$I$159,G101>$G$159),\"Plow Horse\",\"Dog\"))),\"\")","v":"Dog"},{"$f":"IFERROR(VLOOKUP(B101,'Cat 2 Setup'!$A:$F,4,FALSE),\"\")","v":""},{"$f":"IFERROR(VLOOKUP(B101,'Cat 2 Setup'!$A:$F,3,FALSE),\"\")","v":0},{"$f":"IFERROR(VLOOKUP(B101,'Cat 2 Setup'!$A:$F,6,FALSE),\"\")","v":""},{"$f":"IFERROR(E101/$E$159,\"\")","v":""},{"$f":"IFERROR(F101/D101,\"\")","v":""},{"$f":"IFERROR((J101-L101)/J101,\"\")","v":""},{"$f":"IFERROR(D101/E101,\"\")","v":""},{"$f":"IFERROR(E101/$F$3,\"\")","v":""},{"$f":"IFERROR(J101*H101,\"\")","v":""}]
["Proposed",null,{"$f":"IFERROR(IF(AND(I102>$I$160,G102>$G$160),\"Star\",IF(AND(I102>$I$160,G102<$G$160),\"Puzzle\",IF(AND(I102<$I$160,G102>$G$160),\"Plow Horse\",\"Dog\"))),\"\")","v":"Dog"},{"$f":"IFERROR(IF(J102=\"\",D101,E102*J102),D101)","v":""},{"$f":"IFERROR(IF(K102=\"\",E101,K102*$F$3),E101)","v":0},{"$f":"IFERROR(D102*H102,F101)","v":""},{"$f":"IFERROR(IF(E102=\"\",G101,E102/$E$160),G101)","v":""},{"$f":"IFERROR(IF(L102=\"\",H101,L102/J102),H101)","v":""},{"$f":"IFERROR((J102-L102)/J102,\"\")","v":""},{"$f":"J101","v":""},{"$f":"K101","v":""},{"$f":"L101","v":""}]
[]
["Baseline",{"$f":"'Cat 2 Setup'!A41","v":0},{"$f":"IFERROR(IF(AND(I104>$I$159,G104>$G$159),\"Star\",IF(AND(I104>$I$159,G104<$G$159),\"Puzzle\",IF(AND(I104<$I$159,G104>$G$159),\"Plow Horse\",\"Dog\"))),\"\")","v":"Dog"},{"$f":"IFERROR(VLOOKUP(B104,'Cat 2 Setup'!$A:$F,4,FALSE),\"\")","v":""},{"$f":"IFERROR(VLOOKUP(B104,'Cat 2 Setup'!$A:$F,3,FALSE),\"\")","v":0},{"$f":"IFERROR(VLOOKUP(B104,'Cat 2 Setup'!$A:$F,6,FALSE),\"\")","v":""},{"$f":"IFERROR(E104/$E$159,\"\")","v":""},{"$f":"IFERROR(F104/D104,\"\")","v":""},{"$f":"IFERROR((J104-L104)/J104,\"\")","v":""},{"$f":"IFERROR(D104/E104,\"\")","v":""},{"$f":"IFERROR(E104/$F$3,\"\")","v":""},{"$f":"IFERROR(J104*H104,\"\")","v":""}]
["Proposed",null,{"$f":"IFERROR(IF(AND(I105>$I$160,G105>$G$160),\"Star\",IF(AND(I105>$I$160,G105<$G$160),\"Puzzle\",IF(AND(I105<$I$160,G105>$G$160),\"Plow Horse\",\"Dog\"))),\"\")","v":"Dog"},{"$f":"IFERROR(IF(J105=\"\",D104,E105*J105),D104)","v":""},{"$f":"IFERROR(IF(K105=\"\",E104,K105*$F$3),E104)","v":0},{"$f":"IFERROR(D105*H105,F104)","v":""},{"$f":"IFERROR(IF(E105=\"\",G104,E105/$E$160),G104)","v":""},{"$f":"IFERROR(IF(L105=\"\",H104,L105/J105),H104)","v":""},{"$f":"IFERROR((J105-L105)/J105,\"\")","v":""},{"$f":"J104","v":""},{"$f":"K104","v":""},{"$f":"L104","v":""}]
[]
["Baseline",{"$f":"'Cat 2 Setup'!A42","v":0},{"$f":"IFERROR(IF(AND(I107>$I$159,G107>$G$159),\"Star\",IF(AND(I107>$I$159,G107<$G$159),\"Puzzle\",IF(AND(I107<$I$159,G107>$G$159),\"Plow Horse\",\"Dog\"))),\"\")","v":"Dog"},{"$f":"IFERROR(VLOOKUP(B107,'Cat 2 Setup'!$A:$F,4,FALSE),\"\")","v":""},{"$f":"IFERROR(VLOOKUP(B107,'Cat 2 Setup'!$A:$F,3,FALSE),\"\")","v":0},{"$f":"IFERROR(VLOOKUP(B107,'Cat 2 Setup'!$A:$F,6,FALSE),\"\")","v":""},{"$f":"IFERROR(E107/$E$159,\"\")","v":""},{"$f":"IFERROR(F107/D107,\"\")","v":""},{"$f":"IFERROR((J107-L107)/J107,\"\")","v":""},{"$f":"IFERROR(D107/E107,\"\")","v":""},{"$f":"IFERROR(E107/$F$3,\"\")","v":""},{"$f":"IFERROR(J107*H107,\"\")","v":""}]
["Proposed",null,{"$f":"IFERROR(IF(AND(I108>$I$160,G108>$G$160),\"Star\",IF(AND(I108>$I$160,G108<$G$160),\"Puzzle\",IF(AND(I108<$I$160,G108>$G$160),\"Plow Horse\",\"Dog\"))),\"\")","v":"Dog"},{"$f":"IFERROR(IF(J108=\"\",D107,E108*J108),D107)","v":""},{"$f":"IFERROR(IF(K108=\"\",E107,K108*$F$3),E107)","v":0},{"$f":"IFERROR(D108*H108,F107)","v":""},{"$f":"IFERROR(IF(E108=\"\",G107,E108/$E$160),G107)","v":""},{"$f":"IFERROR(IF(L108=\"\",H107,L108/J108),H107)","v":""},{"$f":"IFERROR((J108-L108)/J108,\"\")","v":""},{"$f":"J107","v":""},{"$f":"K107","v":""},{"$f":"L107","v":""}]
[]
["Baseline",{"$f":"'Cat 2 Setup'!A43","v":0},{"$f":"IFERROR(IF(AND(I110>$I$159,G110>$G$159),\"Star\",IF(AND(I110>$I$159,G110<$G$159),\"Puzzle\",IF(AND(I110<$I$159,G110>$G$159),\"Plow Horse\",\"Dog\"))),\"\")","v":"Dog"},{"$f":"IFERROR(VLOOKUP(B110,'Cat 2 Setup'!$A:$F,4,FALSE),\"\")","v":""},{"$f":"IFERROR(VLOOKUP(B110,'Cat 2 Setup'!$A:$F,3,FALSE),\"\")","v":0},{"$f":"IFERROR(VLOOKUP(B110,'Cat 2 Setup'!$A:$F,6,FALSE),\"\")","v":""},{"$f":"IFERROR(E110/$E$159,\"\")","v":""},{"$f":"IFERROR(F110/D110,\"\")","v":""},{"$f":"IFERROR((J110-L110)/J110,\"\")","v":""},{"$f":"IFERROR(D110/E110,\"\")","v":""},{"$f":"IFERROR(E110/$F$3,\"\")","v":""},{"$f":"IFERROR(J110*H110,\"\")","v":""}]
["Proposed",null,{"$f":"IFERROR(IF(AND(I111>$I$160,G111>$G$160),\"Star\",IF(AND(I111>$I$160,G111<$G$160),\"Puzzle\",IF(AND(I111<$I$160,G111>$G$160),\"Plow Horse\",\"Dog\"))),\"\")","v":"Dog"},{"$f":"IFERROR(IF(J111=\"\",D110,E111*J111),D110)","v":""},{"$f":"IFERROR(IF(K111=\"\",E110,K111*$F$3),E110)","v":0},{"$f":"IFERROR(D111*H111,F110)","v":""},{"$f":"IFERROR(IF(E111=\"\",G110,E111/$E$160),G110)","v":""},{"$f":"IFERROR(IF(L111=\"\",H110,L111/J111),H110)","v":""},{"$f":"IFERROR((J111-L111)/J111,\"\")","v":""},{"$f":"J110","v":""},{"$f":"K110","v":""},{"$f":"L110","v":""}]
[]
["Baseline",{"$f":"'Cat 2 Setup'!A44","v":0},{"$f":"IFERROR(IF(AND(I113>$I$159,G113>$G$159),\"Star\",IF(AND(I113>$I$159,G113<$G$159),\"Puzzle\",IF(AND(I113<$I$159,G113>$G$159),\"Plow Horse\",\"Dog\"))),\"\")","v":"Dog"},{"$f":"IFERROR(VLOOKUP(B113,'Cat 2 Setup'!$A:$F,4,FALSE),\"\")","v":""},{"$f":"IFERROR(VLOOKUP(B113,'Cat 2 Setup'!$A:$F,3,FALSE),\"\")","v":0},{"$f":"IFERROR(VLOOKUP(B113,'Cat 2 Setup'!$A:$F,6,FALSE),\"\")","v":""},{"$f":"IFERROR(E113/$E$159,\"\")","v":""},{"$f":"IFERROR(F113/D113,\"\")","v":""},{"$f":"IFERROR((J113-L113)/J113,\"\")","v":""},{"$f":"IFERROR(D113/E113,\"\")","v":""},{"$f":"IFERROR(E113/$F$3,\"\")","v":""},{"$f":"IFERROR(J113*H113,\"\")","v":""}]
["Proposed",null,{"$f":"IFERROR(IF(AND(I114>$I$160,G114>$G$160),\"Star\",IF(AND(I114>$I$160,G114<$G$160),\"Puzzle\",IF(AND(I114<$I$160,G114>$G$160),\"Plow Horse\",\"Dog\"))),\"\")","v":"Dog"},{"$f":"IFERROR(IF(J114=\"\",D113,E114*J114),D113)","v":""},{"$f":"IFERROR(IF(K114=\"\",E113,K114*$F$3),E113)","v":0},{"$f":"IFERROR(D114*H114,F113)","v":""},{"$f":"IFERROR(IF(E114=\"\",G113,E114/$E$160),G113)","v":""},{"$f":"IFERROR(IF(L114=\"\",H113,L114/J114),H113)","v":""},{"$f":"IFERROR((J114-L114)/J114,\"\")","v":""},{"$f":"J113","v":""},{"$f":"K113","v":""},{"$f":"L113","v":""}]
[]
["Baseline",{"$f":"'Cat 2 Setup'!A45","v":0},{"$f":"IFERROR(IF(AND(I116>$I$159,G116>$G$159),\"Star\",IF(AND(I116>$I$159,G116<$G$159),\"Puzzle\",IF(AND(I116<$I$159,G116>$G$159),\"Plow Horse\",\"Dog\"))),\"\")","v":"Dog"},{"$f":"IFERROR(VLOOKUP(B116,'Cat 2 Setup'!$A:$F,4,FALSE),\"\")","v":""},{"$f":"IFERROR(VLOOKUP(B116,'Cat 2 Setup'!$A:$F,3,FALSE),\"\")","v":0},{"$f":"IFERROR(VLOOKUP(B116,'Cat 2 Setup'!$A:$F,6,FALSE),\"\")","v":""},{"$f":"IFERROR(E116/$E$159,\"\")","v":""},{"$f":"IFERROR(F116/D116,\"\")","v":""},{"$f":"IFERROR((J116-L116)/J116,\"\")","v":""},{"$f":"IFERROR(D116/E116,\"\")","v":""},{"$f":"IFERROR(E116/$F$3,\"\")","v":""},{"$f":"IFERROR(J116*H116,\"\")","v":""}]
["Proposed",null,{"$f":"IFERROR(IF(AND(I117>$I$160,G117>$G$160),\"Star\",IF(AND(I117>$I$160,G117<$G$160),\"Puzzle\",IF(AND(I117<$I$160,G117>$G$160),\"Plow Horse\",\"Dog\"))),\"\")","v":"Dog"},{"$f":"IFERROR(IF(J117=\"\",D116,E117*J117),D116)","v":""},{"$f":"IFERROR(IF(K117=\"\",E116,K117*$F$3),E116)","v":0},{"$f":"IFERROR(D117*H117,F116)","v":""},{"$f":"IFERROR(IF(E117=\"\",G116,E117/$E$160),G116)","v":""},{"$f":"IFERROR(IF(L117=\"\",H116,L117/J117),H116)","v":""},{"$f":"IFERROR((J117-L117)/J117,\"\")","v":""},{"$f":"J116","v":""},{"$f":"K116","v":""},{"$f":"L116","v":""}]
[]
["Baseline",{"$f":"'Cat 2 Setup'!A46","v":0},{"$f":"IFERROR(IF(AND(I119>$I$159,G119>$G$159),\"Star\",IF(AND(I119>$I$159,G119<$G$159),\"Puzzle\",IF(AND(I119<$I$159,G119>$G$159),\"Plow Horse\",\"Dog\"))),\"\")","v":"Dog"},{"$f":"IFERROR(VLOOKUP(B119,'Cat 2 Setup'!$A:$F,4,FALSE),\"\")","v":""},{"$f":"IFERROR(VLOOKUP(B119,'Cat 2 Setup'!$A:$F,3,FALSE),\"\")","v":0},{"$f":"IFERROR(VLOOKUP(B119,'Cat 2 Setup'!$A:$F,6,FALSE),\"\")","v":""},{"$f":"IFERROR(E119/$E$159,\"\")","v":""},{"$f":"IFERROR(F119/D119,\"\")","v":""},{"$f":"IFERROR((J119-L119)/J119,\"\")","v":""},{"$f":"IFERROR(D119/E119,\"\")","v":""},{"$f":"IFERROR(E119/$F$3,\"\")","v":""},{"$f":"IFERROR(J119*H119,\"\")","v":""}]
["Proposed",null,{"$f":"IFERROR(IF(AND(I120>$I$160,G120>$G$160),\"Star\",IF(AND(I120>$I$160,G120<$G$160),\"Puzzle\",IF(AND(I120<$I$160,G120>$G$160),\"Plow Horse\",\"Dog\"))),\"\")","v":"Dog"},{"$f":"IFERROR(IF(J120=\"\",D119,E120*J120),D119)","v":""},{"$f":"IFERROR(IF(K120=\"\",E119,K120*$F$3),E119)","v":0},{"$f":"IFERROR(D120*H120,F119)","v":""},{"$f":"IFERROR(IF(E120=\"\",G119,E120/$E$160),G119)","v":""},{"$f":"IFERROR(IF(L120=\"\",H119,L120/J120),H119)","v":""},{"$f":"IFERROR((J120-L120)/J120,\"\")","v":""},{"$f":"J119","v":""},{"$f":"K119","v":""},{"$f":"L119","v":""}]
[]
["Baseline",{"$f":"'Cat 2 Setup'!A47","v":0},{"$f":"IFERROR(IF(AND(I122>$I$159,G122>$G$159),\"Star\",IF(AND(I122>$I$159,G122<$G$159),\"Puzzle\",IF(AND(I122<$I$159,G122>$G$159),\"Plow Horse\",\"Dog\"))),\"\")","v":"Dog"},{"$f":"IFERROR(VLOOKUP(B122,'Cat 2 Setup'!$A:$F,4,FALSE),\"\")","v":""},{"$f":"IFERROR(VLOOKUP(B122,'Cat 2 Setup'!$A:$F,3,FALSE),\"\")","v":0},{"$f":"IFERROR(VLOOKUP(B122,'Cat 2 Setup'!$A:$F,6,FALSE),\"\")","v":""},{"$f":"IFERROR(E122/$E$159,\"\")","v":""},{"$f":"IFERROR(F122/D122,\"\")","v":""},{"$f":"IFERROR((J122-L122)/J122,\"\")","v":""},{"$f":"IFERROR(D122/E122,\"\")","v":""},{"$f":"IFERROR(E122/$F$3,\"\")","v":""},{"$f":"IFERROR(J122*H122,\"\")","v":""}]
["Proposed",null,{"$f":"IFERROR(IF(AND(I123>$I$160,G123>$G$160),\"Star\",IF(AND(I123>$I$160,G123<$G$160),\"Puzzle\",IF(AND(I123<$I$160,G123>$G$160),\"Plow Horse\",\"Dog\"))),\"\")","v":"Dog"},{"$f":"IFERROR(IF(J123=\"\",D122,E123*J123),D122)","v":""},{"$f":"IFERROR(IF(K123=\"\",E122,K123*$F$3),E122)","v":0},{"$f":"IFERROR(D123*H123,F122)","v":""},{"$f":"IFERROR(IF(E123=\"\",G122,E123/$E$160),G122)","v":""},{"$f":"IFERROR(IF(L123=\"\",H122,L123/J123),H122)","v":""},"",{"$f":"J122","v":""},{"$f":"K122","v":""},{"$f":"L122","v":""}]
[]
["Baseline",{"$f":"'Cat 2 Setup'!A48","v":0},{"$f":"IFERROR(IF(AND(I125>$I$159,G125>$G$159),\"Star\",IF(AND(I125>$I$159,G125<$G$159),\"Puzzle\",IF(AND(I125<$I$159,G125>$G$159),\"Plow Horse\",\"Dog\"))),\"\")","v":"Dog"},{"$f":"IFERROR(VLOOKUP(B125,'Cat 2 Setup'!$A:$F,4,FALSE),\"\")","v":""},{"$f":"IFERROR(VLOOKUP(B125,'Cat 2 Setup'!$A:$F,3,FALSE),\"\")","v":0},{"$f":"IFERROR(VLOOKUP(B125,'Cat 2 Setup'!$A:$F,6,FALSE),\"\")","v":""},{"$f":"IFERROR(E125/$E$159,\"\")","v":""},{"$f":"IFERROR(F125/D125,\"\")","v":""},{"$f":"IFERROR((J125-L125)/J125,\"\")","v":""},{"$f":"IFERROR(D125/E125,\"\")","v":""},{"$f":"IFERROR(E125/$F$3,\"\")","v":""},{"$f":"IFERROR(J125*H125,\"\")","v":""}]
["Proposed",null,{"$f":"IFERROR(IF(AND(I126>$I$160,G126>$G$160),\"Star\",IF(AND(I126>$I$160,G126<$G$160),\"Puzzle\",IF(AND(I126<$I$160,G126>$G$160),\"Plow Horse\",\"Dog\"))),\"\")","v":"Dog"},{"$f":"IFERROR(IF(J126=\"\",D125,E126*J126),D125)","v":""},{"$f":"IFERROR(IF(K126=\"\",E125,K126*$F$3),E125)","v":0},{"$f":"IFERROR(D126*H126,F125)","v":""},{"$f":"IFERROR(IF(E126=\"\",G125,E126/$E$160),G125)","v":""},{"$f":"IFERROR(IF(L126=\"\",H125,L126/J126),H125)","v":""},"",{"$f":"J125","v":""},{"$f":"K125","v":""},{"$f":"L125","v":""}]
[]
["Baseline",{"$f":"'Cat 2 Setup'!A49","v":0},{"$f":"IFERROR(IF(AND(I128>$I$159,G128>$G$159),\"Star\",IF(AND(I128>$I$159,G128<$G$159),\"Puzzle\",IF(AND(I128<$I$159,G128>$G$159),\"Plow Horse\",\"Dog\"))),\"\")","v":"Dog"},{"$f":"IFERROR(VLOOKUP(B128,'Cat 2 Setup'!$A:$F,4,FALSE),\"\")","v":""},{"$f":"IFERROR(VLOOKUP(B128,'Cat 2 Setup'!$A:$F,3,FALSE),\"\")","v":0},{"$f":"IFERROR(VLOOKUP(B128,'Cat 2 Setup'!$A:$F,6,FALSE),\"\")","v":""},{"$f":"IFERROR(E128/$E$159,\"\")","v":""},{"$f":"IFERROR(F128/D128,\"\")","v":""},{"$f":"IFERROR((J128-L128)/J128,\"\")","v":""},{"$f":"IFERROR(D128/E128,\"\")","v":""},{"$f":"IFERROR(E128/$F$3,\"\")","v":""},{"$f":"IFERROR(J128*H128,\"\")","v":""}]
["Proposed",null,{"$f":"IFERROR(IF(AND(I129>$I$160,G129>$G$160),\"Star\",IF(AND(I129>$I$160,G129<$G$160),\"Puzzle\",IF(AND(I129<$I$160,G129>$G$160),\"Plow Horse\",\"Dog\"))),\"\")","v":"Dog"},{"$f":"IFERROR(IF(J129=\"\",D128,E129*J129),D128)","v":""},{"$f":"IFERROR(IF(K129=\"\",E128,K129*$F$3),E128)","v":0},{"$f":"IFERROR(D129*H129,F128)","v":""},{"$f":"IFERROR(IF(E129=\"\",G128,E129/$E$160),G128)","v":""},{"$f":"IFERROR(IF(L129=\"\",H128,L129/J129),H128)","v":""},"",{"$f":"J128","v":""},{"$f":"K128","v":""},{"$f":"L128","v":""}]
[]
["Baseline",{"$f":"'Cat 2 Setup'!A50","v":0},{"$f":"IFERROR(IF(AND(I131>$I$159,G131>$G$159),\"Star\",IF(AND(I131>$I$159,G131<$G$159),\"Puzzle\",IF(AND(I131<$I$159,G131>$G$159),\"Plow Horse\",\"Dog\"))),\"\")","v":"Dog"},{"$f":"IFERROR(VLOOKUP(B131,'Cat 2 Setup'!$A:$F,4,FALSE),\"\")","v":""},{"$f":"IFERROR(VLOOKUP(B131,'Cat 2 Setup'!$A:$F,3,FALSE),\"\")","v":0},{"$f":"IFERROR(VLOOKUP(B131,'Cat 2 Setup'!$A:$F,6,FALSE),\"\")","v":""},{"$f":"IFERROR(E131/$E$159,\"\")","v":""},{"$f":"IFERROR(F131/D131,\"\")","v":""},{"$f":"IFERROR((J131-L131)/J131,\"\")","v":""},{"$f":"IFERROR(D131/E131,\"\")","v":""},{"$f":"IFERROR(E131/$F$3,\"\")","v":""},{"$f":"IFERROR(J131*H131,\"\")","v":""}]
["Proposed",null,{"$f":"IFERROR(IF(AND(I132>$I$160,G132>$G$160),\"Star\",IF(AND(I132>$I$160,G132<$G$160),\"Puzzle\",IF(AND(I132<$I$160,G132>$G$160),\"Plow Horse\",\"Dog\"))),\"\")","v":"Dog"},{"$f":"IFERROR(IF(J132=\"\",D131,E132*J132),D131)","v":""},{"$f":"IFERROR(IF(K132=\"\",E131,K132*$F$3),E131)","v":0},{"$f":"IFERROR(D132*H132,F131)","v":""},{"$f":"IFERROR(IF(E132=\"\",G131,E132/$E$160),G131)","v":""},{"$f":"IFERROR(IF(L132=\"\",H131,L132/J132),H131)","v":""},"",{"$f":"J131","v":""},{"$f":"K131","v":""},{"$f":"L131","v":""}]
[]
["Baseline",{"$f":"'Cat 2 Setup'!A51","v":0},{"$f":"IFERROR(IF(AND(I134>$I$159,G134>$G$159),\"Star\",IF(AND(I134>$I$159,G134<$G$159),\"Puzzle\",IF(AND(I134<$I$159,G134>$G$159),\"Plow Horse\",\"Dog\"))),\"\")","v":"Dog"},{"$f":"IFERROR(VLOOKUP(B134,'Cat 2 Setup'!$A:$F,4,FALSE),\"\")","v":""},{"$f":"IFERROR(VLOOKUP(B134,'Cat 2 Setup'!$A:$F,3,FALSE),\"\")","v":0},{"$f":"IFERROR(VLOOKUP(B134,'Cat 2 Setup'!$A:$F,6,FALSE),\"\")","v":""},{"$f":"IFERROR(E134/$E$159,\"\")","v":""},{"$f":"IFERROR(F134/D134,\"\")","v":""},{"$f":"IFERROR((J134-L134)/J134,\"\")","v":""},{"$f":"IFERROR(D134/E134,\"\")","v":""},{"$f":"IFERROR(E134/$F$3,\"\")","v":""},{"$f":"IFERROR(J134*H134,\"\")","v":""}]
["Proposed",null,{"$f":"IFERROR(IF(AND(I135>$I$160,G135>$G$160),\"Star\",IF(AND(I135>$I$160,G135<$G$160),\"Puzzle\",IF(AND(I135<$I$160,G135>$G$160),\"Plow Horse\",\"Dog\"))),\"\")","v":"Dog"},{"$f":"IFERROR(IF(J135=\"\",D134,E135*J135),D134)","v":""},{"$f":"IFERROR(IF(K135=\"\",E134,K135*$F$3),E134)","v":0},{"$f":"IFERROR(D135*H135,F134)","v":""},{"$f":"IFERROR(IF(E135=\"\",G134,E135/$E$160),G134)","v":""},{"$f":"IFERROR(IF(L135=\"\",H134,L135/J135),H134)","v":""},"",{"$f":"J134","v":""},{"$f":"K134","v":""},{"$f":"L134","v":""}]
[]
["Baseline",{"$f":"'Cat 2 Setup'!A52","v":0},{"$f":"IFERROR(IF(AND(I137>$I$159,G137>$G$159),\"Star\",IF(AND(I137>$I$159,G137<$G$159),\"Puzzle\",IF(AND(I137<$I$159,G137>$G$159),\"Plow Horse\",\"Dog\"))),\"\")","v":"Dog"},{"$f":"IFERROR(VLOOKUP(B137,'Cat 2 Setup'!$A:$F,4,FALSE),\"\")","v":""},{"$f":"IFERROR(VLOOKUP(B137,'Cat 2 Setup'!$A:$F,3,FALSE),\"\")","v":0},{"$f":"IFERROR(VLOOKUP(B137,'Cat 2 Setup'!$A:$F,6,FALSE),\"\")","v":""},{"$f":"IFERROR(E137/$E$159,\"\")","v":""},{"$f":"IFERROR(F137/D137,\"\")","v":""},{"$f":"IFERROR((J137-L137)/J137,\"\")","v":""},{"$f":"IFERROR(D137/E137,\"\")","v":""},{"$f":"IFERROR(E137/$F$3,\"\")","v":""},{"$f":"IFERROR(J137*H137,\"\")","v":""}]
["Proposed",null,{"$f":"IFERROR(IF(AND(I138>$I$160,G138>$G$160),\"Star\",IF(AND(I138>$I$160,G138<$G$160),\"Puzzle\",IF(AND(I138<$I$160,G138>$G$160),\"Plow Horse\",\"Dog\"))),\"\")","v":"Dog"},{"$f":"IFERROR(IF(J138=\"\",D137,E138*J138),D137)","v":""},{"$f":"IFERROR(IF(K138=\"\",E137,K138*$F$3),E137)","v":0},{"$f":"IFERROR(D138*H138,F137)","v":""},{"$f":"IFERROR(IF(E138=\"\",G137,E138/$E$160),G137)","v":""},{"$f":"IFERROR(IF(L138=\"\",H137,L138/J138),H137)","v":""},"",{"$f":"J137","v":""},{"$f":"K137","v":""},{"$f":"L137","v":""}]
[]
["Baseline",{"$f":"'Cat 2 Setup'!A53","v":0},{"$f":"IFERROR(IF(AND(I140>$I$159,G140>$G$159),\"Star\",IF(AND(I140>$I$159,G140<$G$159),\"Puzzle\",IF(AND(I140<$I$159,G140>$G$159),\"Plow Horse\",\"Dog\"))),\"\")","v":"Dog"},{"$f":"IFERROR(VLOOKUP(B140,'Cat 2 Setup'!$A:$F,4,FALSE),\"\")","v":""},{"$f":"IFERROR(VLOOKUP(B140,'Cat 2 Setup'!$A:$F,3,FALSE),\"\")","v":0},{"$f":"IFERROR(VLOOKUP(B140,'Cat 2 Setup'!$A:$F,6,FALSE),\"\")","v":""},{"$f":"IFERROR(E140/$E$159,\"\")","v":""},{"$f":"IFERROR(F140/D140,\"\")","v":""},{"$f":"IFERROR((J140-L140)/J140,\"\")","v":""},{"$f":"IFERROR(D140/E140,\"\")","v":""},{"$f":"IFERROR(E140/$F$3,\"\")","v":""},{"$f":"IFERROR(J140*H140,\"\")","v":""}]
["Proposed",null,{"$f":"IFERROR(IF(AND(I141>$I$160,G141>$G$160),\"Star\",IF(AND(I141>$I$160,G141<$G$160),\"Puzzle\",IF(AND(I141<$I$160,G141>$G$160),\"Plow Horse\",\"Dog\"))),\"\")","v":"Dog"},{"$f":"IFERROR(IF(J141=\"\",D140,E141*J141),D140)","v":""},{"$f":"IFERROR(IF(K141=\"\",E140,K141*$F$3),E140)","v":0},{"$f":"IFERROR(D141*H141,F140)","v":""},{"$f":"IFERROR(IF(E141=\"\",G140,E141/$E$160),G140)","v":""},{"$f":"IFERROR(IF(L141=\"\",H140,L141/J141),H140)","v":""},"",{"$f":"J140","v":""},{"$f":"K140","v":""},{"$f":"L140","v":""}]
[]
["Baseline",{"$f":"'Cat 2 Setup'!A54","v":0},{"$f":"IFERROR(IF(AND(I143>$I$159,G143>$G$159),\"Star\",IF(AND(I143>$I$159,G143<$G$159),\"Puzzle\",IF(AND(I143<$I$159,G143>$G$159),\"Plow Horse\",\"Dog\"))),\"\")","v":"Dog"},{"$f":"IFERROR(VLOOKUP(B143,'Cat 2 Setup'!$A:$F,4,FALSE),\"\")","v":""},{"$f":"IFERROR(VLOOKUP(B143,'Cat 2 Setup'!$A:$F,3,FALSE),\"\")","v":0},{"$f":"IFERROR(VLOOKUP(B143,'Cat 2 Setup'!$A:$F,6,FALSE),\"\")","v":""},{"$f":"IFERROR(E143/$E$159,\"\")","v":""},{"$f":"IFERROR(F143/D143,\"\")","v":""},{"$f":"IFERROR((J143-L143)/J143,\"\")","v":""},{"$f":"IFERROR(D143/E143,\"\")","v":""},{"$f":"IFERROR(E143/$F$3,\"\")","v":""},{"$f":"IFERROR(J143*H143,\"\")","v":""}]
["Proposed",null,{"$f":"IFERROR(IF(AND(I144>$I$160,G144>$G$160),\"Star\",IF(AND(I144>$I$160,G144<$G$160),\"Puzzle\",IF(AND(I144<$I$160,G144>$G$160),\"Plow Horse\",\"Dog\"))),\"\")","v":"Dog"},{"$f":"IFERROR(IF(J144=\"\",D143,E144*J144),D143)","v":""},{"$f":"IFERROR(IF(K144=\"\",E143,K144*$F$3),E143)","v":0},{"$f":"IFERROR(D144*H144,F143)","v":""},{"$f":"IFERROR(IF(E144=\"\",G143,E144/$E$160),G143)","v":""},{"$f":"IFERROR(IF(L144=\"\",H143,L144/J144),H143)","v":""},"",{"$f":"J143","v":""},{"$f":"K143","v":""},{"$f":"L143","v":""}]
[]
["Baseline",{"$f":"'Cat 2 Setup'!A55","v":0},{"$f":"IFERROR(IF(AND(I146>$I$159,G146>$G$159),\"Star\",IF(AND(I146>$I$159,G146<$G$159),\"Puzzle\",IF(AND(I146<$I$159,G146>$G$159),\"Plow Horse\",\"Dog\"))),\"\")","v":"Dog"},{"$f":"IFERROR(VLOOKUP(B146,'Cat 2 Setup'!$A:$F,4,FALSE),\"\")","v":""},{"$f":"IFERROR(VLOOKUP(B146,'Cat 2 Setup'!$A:$F,3,FALSE),\"\")","v":0},{"$f":"IFERROR(VLOOKUP(B146,'Cat 2 Setup'!$A:$F,6,FALSE),\"\")","v":""},{"$f":"IFERROR(E146/$E$159,\"\")","v":""},{"$f":"IFERROR(F146/D146,\"\")","v":""},{"$f":"IFERROR((J146-L146)/J146,\"\")","v":""},{"$f":"IFERROR(D146/E146,\"\")","v":""},{"$f":"IFERROR(E146/$F$3,\"\")","v":""},{"$f":"IFERROR(J146*H146,\"\")","v":""}]
["Proposed",null,{"$f":"IFERROR(IF(AND(I147>$I$160,G147>$G$160),\"Star\",IF(AND(I147>$I$160,G147<$G$160),\"Puzzle\",IF(AND(I147<$I$160,G147>$G$160),\"Plow Horse\",\"Dog\"))),\"\")","v":"Dog"},{"$f":"IFERROR(IF(J147=\"\",D146,E147*J147),D146)","v":""},{"$f":"IFERROR(IF(K147=\"\",E146,K147*$F$3),E146)","v":0},{"$f":"IFERROR(D147*H147,F146)","v":""},{"$f":"IFERROR(IF(E147=\"\",G146,E147/$E$160),G146)","v":""},{"$f":"IFERROR(IF(L147=\"\",H146,L147/J147),H146)","v":""},"",{"$f":"J146","v":""},{"$f":"K146","v":""},{"$f":"L146","v":""}]
[]
["Baseline",{"$f":"'Cat 2 Setup'!A56","v":0},{"$f":"IFERROR(IF(AND(I149>$I$159,G149>$G$159),\"Star\",IF(AND(I149>$I$159,G149<$G$159),\"Puzzle\",IF(AND(I149<$I$159,G149>$G$159),\"Plow Horse\",\"Dog\"))),\"\")","v":"Dog"},{"$f":"IFERROR(VLOOKUP(B149,'Cat 2 Setup'!$A:$F,4,FALSE),\"\")","v":""},{"$f":"IFERROR(VLOOKUP(B149,'Cat 2 Setup'!$A:$F,3,FALSE),\"\")","v":0},{"$f":"IFERROR(VLOOKUP(B149,'Cat 2 Setup'!$A:$F,6,FALSE),\"\")","v":""},{"$f":"IFERROR(E149/$E$159,\"\")","v":""},{"$f":"IFERROR(F149/D149,\"\")","v":""},{"$f":"IFERROR((J149-L149)/J149,\"\")","v":""},{"$f":"IFERROR(D149/E149,\"\")","v":""},{"$f":"IFERROR(E149/$F$3,\"\")","v":""},{"$f":"IFERROR(J149*H149,\"\")","v":""}]
["Proposed",null,{"$f":"IFERROR(IF(AND(I150>$I$160,G150>$G$160),\"Star\",IF(AND(I150>$I$160,G150<$G$160),\"Puzzle\",IF(AND(I150<$I$160,G150>$G$160),\"Plow Horse\",\"Dog\"))),\"\")","v":"Dog"},{"$f":"IFERROR(IF(J150=\"\",D149,E150*J150),D149)","v":""},{"$f":"IFERROR(IF(K150=\"\",E149,K150*$F$3),E149)","v":0},{"$f":"IFERROR(D150*H150,F149)","v":""},{"$f":"IFERROR(IF(E150=\"\",G149,E150/$E$160),G149)","v":""},{"$f":"IFERROR(IF(L150=\"\",H149,L150/J150),H149)","v":""},"",{"$f":"J149","v":""},{"$f":"K149","v":""},{"$f":"L149","v":""}]
[]
["Baseline",{"$f":"'Cat 2 Setup'!A57","v":0},{"$f":"IFERROR(IF(AND(I152>$I$159,G152>$G$159),\"Star\",IF(AND(I152>$I$159,G152<$G$159),\"Puzzle\",IF(AND(I152<$I$159,G152>$G$159),\"Plow Horse\",\"Dog\"))),\"\")","v":"Dog"},{"$f":"IFERROR(VLOOKUP(B152,'Cat 2 Setup'!$A:$F,4,FALSE),\"\")","v":""},{"$f":"IFERROR(VLOOKUP(B152,'Cat 2 Setup'!$A:$F,3,FALSE),\"\")","v":0},{"$f":"IFERROR(VLOOKUP(B152,'Cat 2 Setup'!$A:$F,6,FALSE),\"\")","v":""},{"$f":"IFERROR(E152/$E$159,\"\")","v":""},{"$f":"IFERROR(F152/D152,\"\")","v":""},{"$f":"IFERROR((J152-L152)/J152,\"\")","v":""},{"$f":"IFERROR(D152/E152,\"\")","v":""},{"$f":"IFERROR(E152/$F$3,\"\")","v":""},{"$f":"IFERROR(J152*H152,\"\")","v":""}]
["Proposed",null,{"$f":"IFERROR(IF(AND(I153>$I$160,G153>$G$160),\"Star\",IF(AND(I153>$I$160,G153<$G$160),\"Puzzle\",IF(AND(I153<$I$160,G153>$G$160),\"Plow Horse\",\"Dog\"))),\"\")","v":"Dog"},{"$f":"IFERROR(IF(J153=\"\",D152,E153*J153),D152)","v":""},{"$f":"IFERROR(IF(K153=\"\",E152,K153*$F$3),E152)","v":0},{"$f":"IFERROR(D153*H153,F152)","v":""},{"$f":"IFERROR(IF(E153=\"\",G152,E153/$E$160),G152)","v":""},{"$f":"IFERROR(IF(L153=\"\",H152,L153/J153),H152)","v":""},"",{"$f":"J152","v":""},{"$f":"K152","v":""},{"$f":"L152","v":""}]
[]
["Baseline",{"$f":"'Cat 2 Setup'!A58","v":0},{"$f":"IFERROR(IF(AND(I155>$I$159,G155>$G$159),\"Star\",IF(AND(I155>$I$159,G155<$G$159),\"Puzzle\",IF(AND(I155<$I$159,G155>$G$159),\"Plow Horse\",\"Dog\"))),\"\")","v":"Dog"},{"$f":"IFERROR(VLOOKUP(B155,'Cat 2 Setup'!$A:$F,4,FALSE),\"\")","v":""},{"$f":"IFERROR(VLOOKUP(B155,'Cat 2 Setup'!$A:$F,3,FALSE),\"\")","v":0},{"$f":"IFERROR(VLOOKUP(B155,'Cat 2 Setup'!$A:$F,6,FALSE),\"\")","v":""},{"$f":"IFERROR(E155/$E$159,\"\")","v":""},{"$f":"IFERROR(F155/D155,\"\")","v":""},{"$f":"IFERROR((J155-L155)/J155,\"\")","v":""},{"$f":"IFERROR(D155/E155,\"\")","v":""},{"$f":"IFERROR(E155/$F$3,\"\")","v":""},{"$f":"IFERROR(J155*H155,\"\")","v":""}]
["Proposed",null,{"$f":"IFERROR(IF(AND(I156>$I$160,G156>$G$160),\"Star\",IF(AND(I156>$I$160,G156<$G$160),\"Puzzle\",IF(AND(I156<$I$160,G156>$G$160),\"Plow Horse\",\"Dog\"))),\"\")","v":"Dog"},{"$f":"IFERROR(IF(J156=\"\",D155,E156*J156),D155)","v":""},{"$f":"IFERROR(IF(K156=\"\",E155,K156*$F$3),E155)","v":0},{"$f":"IFERROR(D156*H156,F155)","v":""},{"$f":"IFERROR(IF(E156=\"\",G155,E156/$E$160),G155)","v":""},{"$f":"IFERROR(IF(L156=\"\",H155,L156/J156),H155)","v":""},"",{"$f":"J155","v":""},{"$f":"K155","v":""},{"$f":"L155","v":""}]
[]
[null,null,null,null,null,null,null,null,null,null,"(Items/Cover)"]
["Baseline","Total",null,{"$f":"IFERROR(SUMIF($A$8:$A$156,\"Baseline\",D$8:D$156),\"\")","v":0},{"$f":"IFERROR(SUMIF($A$8:$A$156,\"Baseline\",E$8:E$156),\"\")","v":0},{"$f":"IFERROR(SUMIF($A$8:$A$156,\"Baseline\",F$8:F$156),\"\")","v":0},{"$f":"IFERROR((AVERAGEIFS(G$8:G$156,$A$8:$A$156,\"Baseline\",G$8:G$156,\">0\")),\"\")","v":""},{"$f":"IFERROR(F159/D159,\"\")","v":""},{"$f":"IFERROR(AVERAGEIF($A$8:$A$156,\"Baseline\",I$8:I$156),\"\")","v":""},{"$f":"IFERROR(D159/E159,\"\")","v":""},{"$f":"IFERROR(E159/$F$3,\"\")","v":""},{"$f":"IFERROR(F159/E159,\"\")","v":""}]
["Proposed",null,null,{"$f":"IFERROR(SUMIF($A$8:$A$156,\"Proposed\",D$8:D$156),\"\")","v":0},{"$f":"IFERROR(SUMIF($A$8:$A$156,\"Proposed\",E$8:E$156),\"\")","v":0},{"$f":"IFERROR(SUMIF($A$8:$A$156,\"Proposed\",F$8:F$156),\"\")","v":0},{"$f":"IFERROR((AVERAGEIFS(G$8:G$156,$A$8:$A$156,\"Proposed\",G$8:G$156,\">0\")),\"\")","v":""},{"$f":"IFERROR(F160/D160,\"\")","v":""},{"$f":"IFERROR(AVERAGEIF($A$8:$A$156,\"Proposed\",I$8:I$156),\"\")","v":""},{"$f":"IFERROR(D160/E160,\"\")","v":""},{"$f":"IFERROR(E160/$F$3,\"\")","v":""},{"$f":"IFERROR(F160/E160,\"\")","v":""}]
[null,"%/BPs change",null,{"$f":"IFERROR((D160-D159)/D159,\"\")","v":""},{"$f":"IFERROR((E160-E159)/E159,\"\")","v":""},"",{"$f":"(G160-G159)*100","v":{"$error":"#VALUE!"}},{"$f":"(H160-H159)*100","v":{"$error":"#VALUE!"}},{"$f":"IFERROR((I160-I159)/I159,\"\")","v":""},"","",""]
[]
[]
[null,"Assumptions/Exclusions:"]
[]
[]
[]
[]
[]
[]
[null,"Admin Use:"]
[null,"CM (min):",{"$f":"ROUND(MIN(I8:I157),0)-5","v":-5},"Demand (max):",{"$f":"MIN(G8:G157)-0.05","v":-2.6666666666666672E-2}]
[null,"CM (max):",{"$f":"ROUND(MAX(I8:I157),0)+5","v":5},"Demand (min):",{"$f":"MAX(G8:G157)+0.05","v":7.3333333333333334E-2}]

{"sheet":"Cat 2 CM% Chart","index":11,"n_rows":46,"n_cols":7,"rows_kept":46,"cut":false,"hidden":false,"merged":[[44,3,44,4],[45,3,45,4]]}
[{"$f":"CONCATENATE('Cat 2 CM$'!C1,\" \",'Cat 2 CM$'!C5,\" \",'Cat 2 CM$'!C4,\" - \",'Cat 2 CM$'!F5)","v":"0 0 0 - 0"}]
["Menu Enginnering Graph by Contribution Margin Percentage"]
[]
[]
[]
[]
[]
[]
[]
[]
[]
[]
[]
[]
[]
[]
[]
[]
[]
[]
[]
[]
[]
[]
[]
[]
[]
[]
[]
[]
[]
[]
[]
[]
[]
[]
[]
[]
[]
[]
[]
[]
[]
[null,null,null,null,null,"Low","High"]
[null,null,"X-AXIS -->","Menu Mix Parameters:",null,{"$f":"IFERROR(IF('Cat 2 CM%'!D8=\"\",\"\",MIN('Cat 2 CM%'!G8:G157)*0.9),\"\")","v":""},{"$f":"IFERROR(IF('Cat 2 CM%'!D8=\"\",\"\",MAX('Cat 2 CM%'!G8:G157)*1.1),\"\")","v":""}]
[null,null,"Y-AXIS -->","Contribution Margin",null,{"$f":"IFERROR(IF('Cat 2 CM%'!D8=\"\",\"\",MIN('Cat 2 CM%'!$I$8:$I$157)*0.9),\"\")","v":""},{"$f":"IFERROR(IF('Cat 2 CM%'!D8=\"\",\"\",MAX('Cat 2 CM%'!$I$8:$I$157)*1.1),\"\")","v":""}]

{"sheet":"Cat 3 Setup","index":12,"n_rows":60,"n_cols":16,"rows_kept":60,"cut":false,"hidden":false,"merged":[[3,14,4,15],[5,0,6,5]]}
[null,null,null,null,null,null,null,null,null,null,"Restaurant Outlet Name",null,"Check Count"]
[null,null,null,null,null,null,null,null,null,null,"Meal Period",null,"Cover Count"]
[null,null,null,null,null,null,null,null,null,null,"Revenue Center",null,"Average Check"]
[null,null,null,null,null,null,null,null,null,null,"Menu Category",null,"Currency",{"$f":"IFERROR(IF(LEFT(N9,(FIND(MID(N9,MIN(IF(ISNUMBER(1*MID(N9,ROW($1:$255),1)),ROW($1:$255))),1),N9)-1))=\"\",\"$\",LEFT(N9,(FIND(MID(N9,MIN(IF(ISNUMBER(1*MID(N9,ROW($1:$255),1)),ROW($1:$255))),1),N9)-1))),\"\")","v":""}]
[null,null,null,null,null,null,null,null,null,null,"Start Date",null,"End Date"]
[]
[]
["Item Name","Item Number","Qty Sold","Gross Sales","Avg. Item Cost","COGS $",null,null,null,null,"Item Name","Item Number","Qty Sold","Gross Sales","Avg. Item Cost","COGS $"]
[{"$f":"K9","v":0},{"$f":"L9","v":0},{"$f":"VALUE(M9)","v":0},{"$f":"IF($N$4=\"$\",N9,(VALUE(MID(N9,FIND($N$4,N9)+LEN($N$4),LEN(N9)))))","v":{"$error":"#VALUE!"}},{"$f":"IF($N$4=\"$\",O9,(VALUE(MID(O9,FIND($N$4,O9)+LEN($N$4),LEN(O9)))))","v":{"$error":"#VALUE!"}},{"$f":"IF($N$4=\"$\",P9,(VALUE(MID(P9,FIND($N$4,P9)+LEN($N$4),LEN(P9)))))","v":{"$error":"#VALUE!"}},null,null,null,1]
[0,0,0,{"$error":"#VALUE!"},{"$error":"#VALUE!"},{"$error":"#VALUE!"},null,null,null,2]
[0,0,0,{"$error":"#VALUE!"},{"$error":"#VALUE!"},{"$error":"#VALUE!"},null,null,null,3]
[0,0,0,{"$error":"#VALUE!"},{"$error":"#VALUE!"},{"$error":"#VALUE!"},null,null,null,4]
[0,0,0,{"$error":"#VALUE!"},{"$error":"#VALUE!"},{"$error":"#VALUE!"},null,null,null,5]
[0,0,0,{"$error":"#VALUE!"},{"$error":"#VALUE!"},{"$error":"#VALUE!"},null,null,null,6]
[0,0,0,{"$error":"#VALUE!"},{"$error":"#VALUE!"},{"$error":"#VALUE!"},null,null,null,7]
[0,0,0,{"$error":"#VALUE!"},{"$error":"#VALUE!"},{"$error":"#VALUE!"},null,null,null,8]
[0,0,0,{"$error":"#VALUE!"},{"$error":"#VALUE!"},{"$error":"#VALUE!"},null,null,null,9]
[0,0,0,{"$error":"#VALUE!"},{"$error":"#VALUE!"},{"$error":"#VALUE!"},null,null,null,10]
[0,0,0,{"$error":"#VALUE!"},{"$error":"#VALUE!"},{"$error":"#VALUE!"},null,null,null,11]
[0,0,0,{"$error":"#VALUE!"},{"$error":"#VALUE!"},{"$error":"#VALUE!"},null,null,null,12]
[0,0,0,{"$error":"#VALUE!"},{"$error":"#VALUE!"},{"$error":"#VALUE!"},null,null,null,13]
[0,0,0,{"$error":"#VALUE!"},{"$error":"#VALUE!"},{"$error":"#VALUE!"},null,null,null,14]
[0,0,0,{"$error":"#VALUE!"},{"$error":"#VALUE!"},{"$error":"#VALUE!"},null,null,null,15]
[0,0,0,{"$error":"#VALUE!"},{"$error":"#VALUE!"},{"$error":"#VALUE!"},null,null,null,16]
[0,0,0,{"$error":"#VALUE!"},{"$error":"#VALUE!"},{"$error":"#VALUE!"},null,null,null,17]
[0,0,0,{"$error":"#VALUE!"},{"$error":"#VALUE!"},{"$error":"#VALUE!"},null,null,null,18]
[0,0,0,{"$error":"#VALUE!"},{"$error":"#VALUE!"},{"$error":"#VALUE!"},null,null,null,19]
[0,0,0,{"$error":"#VALUE!"},{"$error":"#VALUE!"},{"$error":"#VALUE!"},null,null,null,20]
[0,0,0,{"$error":"#VALUE!"},{"$error":"#VALUE!"},{"$error":"#VALUE!"},null,null,null,21]
[0,0,0,{"$error":"#VALUE!"},{"$error":"#VALUE!"},{"$error":"#VALUE!"},null,null,null,22]
[0,0,0,{"$error":"#VALUE!"},{"$error":"#VALUE!"},{"$error":"#VALUE!"},null,null,null,23]
[0,0,0,{"$error":"#VALUE!"},{"$error":"#VALUE!"},{"$error":"#VALUE!"},null,null,null,24]
[0,0,0,{"$error":"#VALUE!"},{"$error":"#VALUE!"},{"$error":"#VALUE!"},null,null,null,25]
[0,0,0,{"$error":"#VALUE!"},{"$error":"#VALUE!"},{"$error":"#VALUE!"},null,null,null,26]
[0,0,0,{"$error":"#VALUE!"},{"$error":"#VALUE!"},{"$error":"#VALUE!"},null,null,null,27]
[0,0,0,{"$error":"#VALUE!"},{"$error":"#VALUE!"},{"$error":"#VALUE!"},null,null,null,28]
[0,0,0,{"$error":"#VALUE!"},{"$error":"#VALUE!"},{"$error":"#VALUE!"},null,null,null,29]
[0,0,0,{"$error":"#VALUE!"},{"$error":"#VALUE!"},{"$error":"#VALUE!"},null,null,null,30]
[0,0,0,{"$error":"#VALUE!"},{"$error":"#VALUE!"},{"$error":"#VALUE!"},null,null,null,31]
[0,0,0,{"$error":"#VALUE!"},{"$error":"#VALUE!"},{"$error":"#VALUE!"},null,null,null,32]
[{"$f":"K41","v":0},{"$f":"L41","v":0},{"$f":"VALUE(M41)","v":0},{"$f":"IF($N$4=\"$\",N41,(VALUE(MID(N41,FIND($N$4,N41)+LEN($N$4),LEN(N41)))))","v":{"$error":"#VALUE!"}},{"$f":"IF($N$4=\"$\",O41,(VALUE(MID(O41,FIND($N$4,O41)+LEN($N$4),LEN(O41)))))","v":{"$error":"#VALUE!"}},{"$f":"IF($N$4=\"$\",P41,(VALUE(MID(P41,FIND($N$4,P41)+LEN($N$4),LEN(P41)))))","v":{"$error":"#VALUE!"}},null,null,null,33]
[0,0,0,{"$error":"#VALUE!"},{"$error":"#VALUE!"},{"$error":"#VALUE!"},null,null,null,34]
[0,0,0,{"$error":"#VALUE!"},{"$error":"#VALUE!"},{"$error":"#VALUE!"},null,null,null,35]
[0,0,0,{"$error":"#VALUE!"},{"$error":"#VALUE!"},{"$error":"#VALUE!"},null,null,null,36]
[0,0,0,{"$error":"#VALUE!"},{"$error":"#VALUE!"},{"$error":"#VALUE!"},null,null,null,37]
[0,0,0,{"$error":"#VALUE!"},{"$error":"#VALUE!"},{"$error":"#VALUE!"},null,null,null,38]
[0,0,0,{"$error":"#VALUE!"},{"$error":"#VALUE!"},{"$error":"#VALUE!"},null,null,null,39]
[0,0,0,{"$error":"#VALUE!"},{"$error":"#VALUE!"},{"$error":"#VALUE!"},null,null,null,40]
[0,0,0,{"$error":"#VALUE!"},{"$error":"#VALUE!"},{"$error":"#VALUE!"},null,null,null,41]
[0,0,0,{"$error":"#VALUE!"},{"$error":"#VALUE!"},{"$error":"#VALUE!"},null,null,null,42]
[0,0,0,{"$error":"#VALUE!"},{"$error":"#VALUE!"},{"$error":"#VALUE!"},null,null,null,43]
[0,0,0,{"$error":"#VALUE!"},{"$error":"#VALUE!"},{"$error":"#VALUE!"},null,null,null,44]
[0,0,0,{"$error":"#VALUE!"},{"$error":"#VALUE!"},{"$error":"#VALUE!"},null,null,null,45]
[0,0,0,{"$error":"#VALUE!"},{"$error":"#VALUE!"},{"$error":"#VALUE!"},null,null,null,46]
[0,0,0,{"$error":"#VALUE!"},{"$error":"#VALUE!"},{"$error":"#VALUE!"},null,null,null,47]
[0,0,0,{"$error":"#VALUE!"},{"$error":"#VALUE!"},{"$error":"#VALUE!"},null,null,null,48]
[0,0,0,{"$error":"#VALUE!"},{"$error":"#VALUE!"},{"$error":"#VALUE!"},null,null,null,49]
[0,0,0,{"$error":"#VALUE!"},{"$error":"#VALUE!"},{"$error":"#VALUE!"},null,null,null,50]
[null,{"$f":"L59","v":0},{"$f":"VALUE(M59)","v":0},null,{"$f":"MID(O59,FIND($N$4,O59)+LEN($N$4),LEN(O59))","v":""},{"$f":"MID(P59,FIND($N$4,P59)+LEN($N$4),LEN(P59))","v":""}]
[null,null,{"$f":"SUM(C9:C59)","v":0},{"$f":"SUM(D9:D59)","v":{"$error":"#VALUE!"}},null,{"$f":"SUM(F9:F59)","v":{"$error":"#VALUE!"}}]

{"sheet":"Cat 3 CM$","index":13,"n_rows":173,"n_cols":12,"rows_kept":173,"cut":false,"hidden":false,"merged":[[172,3,172,4],[133,1,134,1],[136,1,137,1],[139,1,140,1],[142,1,143,1],[145,1,146,1],[148,1,149,1],[151,1,152,1],[154,1,155,1],[158,1,159,2],[160,1,160,2],[171,3,171,4],[130,1,131,1],[97,1,98,1],[100,1,101,1],[103,1,104,1],[106,1,107,1],[109,1,110,1],[112,1,113,1],[115,1,116,1],[118,1,119,1],[121,1,122,1],[124,1,125,1],[127,1,128,1],[94,1,95,1],[61,1,62,1],[64,1,65,1],[67,1,68,1],[70,1,71,1],[73,1,74,1],[76,1,77,1],[79,1,80,1],[82,1,83,1],[85,1,86,1],[88,1,89,1],[91,1,92,1],[58,1,59,1],[25,1,26,1],[28,1,29,1],[31,1,32,1],[34,1,35,1],[37,1,38,1],[40,1,41,1],[43,1,44,1],[46,1,47,1],[49,1,50,1],[52,1,53,1],[55,1,56,1],[22,1,23,1],[7,1,8,1],[10,1,11,1],[13,1,14,1],[16,1,17,1],[19,1,20,1]]}
[null,"Restaurant Name",{"$f":"'Cat 3 Setup'!L1","v":0}]
[null,"Start Date:",{"$f":"'Cat 3 Setup'!L5","v":"00:00:00"},null,"Check Count:",{"$f":"'Cat 3 Setup'!N1","v":0}]
[null,"End Date",{"$f":"'Cat 3 Setup'!N5","v":"00:00:00"},null,"Cover Count:",{"$f":"'Cat 3 Setup'!N2","v":0}]
[null,"Meal Period:",{"$f":"'Cat 3 Setup'!L2","v":0},null,"Average Check:",{"$f":"'Cat 3 Setup'!N3","v":0}]
[null,"Revenue Center:",{"$f":"'Cat 3 Setup'!L3","v":0},null,"Menu Category",{"$f":"'Cat 3 Setup'!L4","v":0}]
[]
[null,"Item Name","Quadrant","Item Sales","Qty Sold","Food Cost","Menu Mix %","Item Cost %","Contribution Margin $","Item Price","Item/Cover%","Item Cost"]
["Baseline",{"$f":"'Cat 3 Setup'!A9","v":0},{"$f":"IFERROR(IF(AND(I8>$I$159,G8>$G$159),\"Star\",IF(AND(I8>$I$159,G8<$G$159),\"Puzzle\",IF(AND(I8<$I$159,G8>$G$159),\"Plow Horse\",\"Dog\"))),\"\")","v":"Dog"},{"$f":"IFERROR(VLOOKUP(B8,'Cat 3 Setup'!$A:$F,4,FALSE),\"\")","v":""},{"$f":"IFERROR(VLOOKUP(B8,'Cat 3 Setup'!$A:$F,3,FALSE),\"\")","v":0},{"$f":"IFERROR(VLOOKUP(B8,'Cat 3 Setup'!$A:$F,6,FALSE),\"\")","v":""},{"$f":"IFERROR(E8/$E$159,\"\")","v":""},{"$f":"IFERROR(F8/D8,\"\")","v":""},{"$f":"IFERROR(J8-L8,\"\")","v":""},{"$f":"IFERROR(D8/E8,\"\")","v":""},{"$f":"IFERROR(E8/$F$3,\"\")","v":""},{"$f":"IFERROR(J8*H8,\"\")","v":""}]
["Proposed",null,{"$f":"IFERROR(IF(AND(I9>$I$160,G9>$G$160),\"Star\",IF(AND(I9>$I$160,G9<$G$160),\"Puzzle\",IF(AND(I9<$I$160,G9>$G$160),\"Plow Horse\",\"Dog\"))),\"\")","v":"Dog"},{"$f":"IFERROR(IF(J9=\"\",D8,E9*J9),D8)","v":""},{"$f":"IFERROR(IF(K9=\"\",E8,K9*$F$3),E8)","v":0},{"$f":"IFERROR(D9*H9,F8)","v":""},{"$f":"IFERROR(IF(E9=\"\",G8,E9/$E$160),G8)","v":""},{"$f":"IFERROR(IF(L9=\"\",H8,L9/J9),H8)","v":""},{"$f":"IFERROR(J9-L9,\"\")","v":""},{"$f":"J8","v":""},{"$f":"K8","v":""},{"$f":"L8","v":""}]
[]
["Baseline",{"$f":"'Cat 3 Setup'!A10","v":0},{"$f":"IFERROR(IF(AND(I11>$I$159,G11>$G$159),\"Star\",IF(AND(I11>$I$159,G11<$G$159),\"Puzzle\",IF(AND(I11<$I$159,G11>$G$159),\"Plow Horse\",\"Dog\"))),\"\")","v":"Dog"},{"$f":"IFERROR(VLOOKUP(B11,'Cat 3 Setup'!$A:$F,4,FALSE),\"\")","v":""},{"$f":"IFERROR(VLOOKUP(B11,'Cat 3 Setup'!$A:$F,3,FALSE),\"\")","v":0},{"$f":"IFERROR(VLOOKUP(B11,'Cat 3 Setup'!$A:$F,6,FALSE),\"\")","v":""},{"$f":"IFERROR(E11/$E$159,\"\")","v":""},{"$f":"IFERROR(F11/D11,\"\")","v":""},{"$f":"IFERROR(J11-L11,\"\")","v":""},{"$f":"IFERROR(D11/E11,\"\")","v":""},{"$f":"IFERROR(E11/$F$3,\"\")","v":""},{"$f":"IFERROR(J11*H11,\"\")","v":""}]
["Proposed",null,{"$f":"IFERROR(IF(AND(I12>$I$160,G12>$G$160),\"Star\",IF(AND(I12>$I$160,G12<$G$160),\"Puzzle\",IF(AND(I12<$I$160,G12>$G$160),\"Plow Horse\",\"Dog\"))),\"\")","v":"Dog"},{"$f":"IFERROR(IF(J12=\"\",D11,E12*J12),D11)","v":""},{"$f":"IFERROR(IF(K12=\"\",E11,K12*$F$3),E11)","v":0},{"$f":"IFERROR(D12*H12,F11)","v":""},{"$f":"IFERROR(IF(E12=\"\",G11,E12/$E$160),G11)","v":""},{"$f":"IFERROR(IF(L12=\"\",H11,L12/J12),H11)","v":""},{"$f":"IFERROR(J12-L12,\"\")","v":""},{"$f":"J11","v":""},"",""]
[]
["Baseline",{"$f":"'Cat 3 Setup'!A11","v":0},{"$f":"IFERROR(IF(AND(I14>$I$159,G14>$G$159),\"Star\",IF(AND(I14>$I$159,G14<$G$159),\"Puzzle\",IF(AND(I14<$I$159,G14>$G$159),\"Plow Horse\",\"Dog\"))),\"\")","v":"Dog"},{"$f":"IFERROR(VLOOKUP(B14,'Cat 3 Setup'!$A:$F,4,FALSE),\"\")","v":""},{"$f":"IFERROR(VLOOKUP(B14,'Cat 3 Setup'!$A:$F,3,FALSE),\"\")","v":0},{"$f":"IFERROR(VLOOKUP(B14,'Cat 3 Setup'!$A:$F,6,FALSE),\"\")","v":""},{"$f":"IFERROR(E14/$E$159,\"\")","v":""},{"$f":"IFERROR(F14/D14,\"\")","v":""},{"$f":"IFERROR(J14-L14,\"\")","v":""},{"$f":"IFERROR(D14/E14,\"\")","v":""},{"$f":"IFERROR(E14/$F$3,\"\")","v":""},{"$f":"IFERROR(J14*H14,\"\")","v":""}]
["Proposed",null,{"$f":"IFERROR(IF(AND(I15>$I$160,G15>$G$160),\"Star\",IF(AND(I15>$I$160,G15<$G$160),\"Puzzle\",IF(AND(I15<$I$160,G15>$G$160),\"Plow Horse\",\"Dog\"))),\"\")","v":"Dog"},{"$f":"IFERROR(IF(J15=\"\",D14,E15*J15),D14)","v":""},{"$f":"IFERROR(IF(K15=\"\",E14,K15*$F$3),E14)","v":0},{"$f":"IFERROR(D15*H15,F14)","v":""},{"$f":"IFERROR(IF(E15=\"\",G14,E15/$E$160),G14)","v":""},{"$f":"IFERROR(IF(L15=\"\",H14,L15/J15),H14)","v":""},{"$f":"IFERROR(J15-L15,\"\")","v":""},{"$f":"J14","v":""},"",""]
[]
["Baseline",{"$f":"'Cat 3 Setup'!A12","v":0},{"$f":"IFERROR(IF(AND(I17>$I$159,G17>$G$159),\"Star\",IF(AND(I17>$I$159,G17<$G$159),\"Puzzle\",IF(AND(I17<$I$159,G17>$G$159),\"Plow Horse\",\"Dog\"))),\"\")","v":"Dog"},{"$f":"IFERROR(VLOOKUP(B17,'Cat 3 Setup'!$A:$F,4,FALSE),\"\")","v":""},{"$f":"IFERROR(VLOOKUP(B17,'Cat 3 Setup'!$A:$F,3,FALSE),\"\")","v":0},{"$f":"IFERROR(VLOOKUP(B17,'Cat 3 Setup'!$A:$F,6,FALSE),\"\")","v":""},{"$f":"IFERROR(E17/$E$159,\"\")","v":""},{"$f":"IFERROR(F17/D17,\"\")","v":""},{"$f":"IFERROR(J17-L17,\"\")","v":""},{"$f":"IFERROR(D17/E17,\"\")","v":""},{"$f":"IFERROR(E17/$F$3,\"\")","v":""},{"$f":"IFERROR(J17*H17,\"\")","v":""}]
["Proposed",null,{"$f":"IFERROR(IF(AND(I18>$I$160,G18>$G$160),\"Star\",IF(AND(I18>$I$160,G18<$G$160),\"Puzzle\",IF(AND(I18<$I$160,G18>$G$160),\"Plow Horse\",\"Dog\"))),\"\")","v":"Dog"},{"$f":"IFERROR(IF(J18=\"\",D17,E18*J18),D17)","v":""},{"$f":"IFERROR(IF(K18=\"\",E17,K18*$F$3),E17)","v":0},{"$f":"IFERROR(D18*H18,F17)","v":""},{"$f":"IFERROR(IF(E18=\"\",G17,E18/$E$160),G17)","v":""},{"$f":"IFERROR(IF(L18=\"\",H17,L18/J18),H17)","v":""},{"$f":"IFERROR(J18-L18,\"\")","v":""},{"$f":"J17","v":""},"",""]
[]
["Baseline",{"$f":"'Cat 3 Setup'!A13","v":0},{"$f":"IFERROR(IF(AND(I20>$I$159,G20>$G$159),\"Star\",IF(AND(I20>$I$159,G20<$G$159),\"Puzzle\",IF(AND(I20<$I$159,G20>$G$159),\"Plow Horse\",\"Dog\"))),\"\")","v":"Dog"},{"$f":"IFERROR(VLOOKUP(B20,'Cat 3 Setup'!$A:$F,4,FALSE),\"\")","v":""},{"$f":"IFERROR(VLOOKUP(B20,'Cat 3 Setup'!$A:$F,3,FALSE),\"\")","v":0},{"$f":"IFERROR(VLOOKUP(B20,'Cat 3 Setup'!$A:$F,6,FALSE),\"\")","v":""},{"$f":"IFERROR(E20/$E$159,\"\")","v":""},{"$f":"IFERROR(F20/D20,\"\")","v":""},{"$f":"IFERROR(J20-L20,\"\")","v":""},{"$f":"IFERROR(D20/E20,\"\")","v":""},{"$f":"IFERROR(E20/$F$3,\"\")","v":""},{"$f":"IFERROR(J20*H20,\"\")","v":""}]
["Proposed",null,{"$f":"IFERROR(IF(AND(I21>$I$160,G21>$G$160),\"Star\",IF(AND(I21>$I$160,G21<$G$160),\"Puzzle\",IF(AND(I21<$I$160,G21>$G$160),\"Plow Horse\",\"Dog\"))),\"\")","v":"Dog"},{"$f":"IFERROR(IF(J21=\"\",D20,E21*J21),D20)","v":""},{"$f":"IFERROR(IF(K21=\"\",E20,K21*$F$3),E20)","v":0},{"$f":"IFERROR(D21*H21,F20)","v":""},{"$f":"IFERROR(IF(E21=\"\",G20,E21/$E$160),G20)","v":""},{"$f":"IFERROR(IF(L21=\"\",H20,L21/J21),H20)","v":""},{"$f":"IFERROR(J21-L21,\"\")","v":""},{"$f":"J20","v":""},"",""]
[]
["Baseline",{"$f":"'Cat 3 Setup'!A14","v":0},{"$f":"IFERROR(IF(AND(I23>$I$159,G23>$G$159),\"Star\",IF(AND(I23>$I$159,G23<$G$159),\"Puzzle\",IF(AND(I23<$I$159,G23>$G$159),\"Plow Horse\",\"Dog\"))),\"\")","v":"Dog"},{"$f":"IFERROR(VLOOKUP(B23,'Cat 3 Setup'!$A:$F,4,FALSE),\"\")","v":""},{"$f":"IFERROR(VLOOKUP(B23,'Cat 3 Setup'!$A:$F,3,FALSE),\"\")","v":0},{"$f":"IFERROR(VLOOKUP(B23,'Cat 3 Setup'!$A:$F,6,FALSE),\"\")","v":""},{"$f":"IFERROR(E23/$E$159,\"\")","v":""},{"$f":"IFERROR(F23/D23,\"\")","v":""},{"$f":"IFERROR(J23-L23,\"\")","v":""},{"$f":"IFERROR(D23/E23,\"\")","v":""},{"$f":"IFERROR(E23/$F$3,\"\")","v":""},{"$f":"IFERROR(J23*H23,\"\")","v":""}]
["Proposed",null,{"$f":"IFERROR(IF(AND(I24>$I$160,G24>$G$160),\"Star\",IF(AND(I24>$I$160,G24<$G$160),\"Puzzle\",IF(AND(I24<$I$160,G24>$G$160),\"Plow Horse\",\"Dog\"))),\"\")","v":"Dog"},{"$f":"IFERROR(IF(J24=\"\",D23,E24*J24),D23)","v":""},{"$f":"IFERROR(IF(K24=\"\",E23,K24*$F$3),E23)","v":0},{"$f":"IFERROR(D24*H24,F23)","v":""},{"$f":"IFERROR(IF(E24=\"\",G23,E24/$E$160),G23)","v":""},{"$f":"IFERROR(IF(L24=\"\",H23,L24/J24),H23)","v":""},{"$f":"IFERROR(J24-L24,\"\")","v":""},{"$f":"J23","v":""},"",""]
[]
["Baseline",{"$f":"'Cat 3 Setup'!A15","v":0},{"$f":"IFERROR(IF(AND(I26>$I$159,G26>$G$159),\"Star\",IF(AND(I26>$I$159,G26<$G$159),\"Puzzle\",IF(AND(I26<$I$159,G26>$G$159),\"Plow Horse\",\"Dog\"))),\"\")","v":"Dog"},{"$f":"IFERROR(VLOOKUP(B26,'Cat 3 Setup'!$A:$F,4,FALSE),\"\")","v":""},{"$f":"IFERROR(VLOOKUP(B26,'Cat 3 Setup'!$A:$F,3,FALSE),\"\")","v":0},{"$f":"IFERROR(VLOOKUP(B26,'Cat 3 Setup'!$A:$F,6,FALSE),\"\")","v":""},{"$f":"IFERROR(E26/$E$159,\"\")","v":""},{"$f":"IFERROR(F26/D26,\"\")","v":""},{"$f":"IFERROR(J26-L26,\"\")","v":""},{"$f":"IFERROR(D26/E26,\"\")","v":""},{"$f":"IFERROR(E26/$F$3,\"\")","v":""},{"$f":"IFERROR(J26*H26,\"\")","v":""}]
["Proposed",null,{"$f":"IFERROR(IF(AND(I27>$I$160,G27>$G$160),\"Star\",IF(AND(I27>$I$160,G27<$G$160),\"Puzzle\",IF(AND(I27<$I$160,G27>$G$160),\"Plow Horse\",\"Dog\"))),\"\")","v":"Dog"},{"$f":"IFERROR(IF(J27=\"\",D26,E27*J27),D26)","v":""},{"$f":"IFERROR(IF(K27=\"\",E26,K27*$F$3),E26)","v":0},{"$f":"IFERROR(D27*H27,F26)","v":""},{"$f":"IFERROR(IF(E27=\"\",G26,E27/$E$160),G26)","v":""},{"$f":"IFERROR(IF(L27=\"\",H26,L27/J27),H26)","v":""},{"$f":"IFERROR(J27-L27,\"\")","v":""},{"$f":"J26","v":""},"",""]
[]
["Baseline",{"$f":"'Cat 3 Setup'!A16","v":0},{"$f":"IFERROR(IF(AND(I29>$I$159,G29>$G$159),\"Star\",IF(AND(I29>$I$159,G29<$G$159),\"Puzzle\",IF(AND(I29<$I$159,G29>$G$159),\"Plow Horse\",\"Dog\"))),\"\")","v":"Dog"},{"$f":"IFERROR(VLOOKUP(B29,'Cat 3 Setup'!$A:$F,4,FALSE),\"\")","v":""},{"$f":"IFERROR(VLOOKUP(B29,'Cat 3 Setup'!$A:$F,3,FALSE),\"\")","v":0},{"$f":"IFERROR(VLOOKUP(B29,'Cat 3 Setup'!$A:$F,6,FALSE),\"\")","v":""},{"$f":"IFERROR(E29/$E$159,\"\")","v":""},{"$f":"IFERROR(F29/D29,\"\")","v":""},{"$f":"IFERROR(J29-L29,\"\")","v":""},{"$f":"IFERROR(D29/E29,\"\")","v":""},{"$f":"IFERROR(E29/$F$3,\"\")","v":""},{"$f":"IFERROR(J29*H29,\"\")","v":""}]
["Proposed",null,{"$f":"IFERROR(IF(AND(I30>$I$160,G30>$G$160),\"Star\",IF(AND(I30>$I$160,G30<$G$160),\"Puzzle\",IF(AND(I30<$I$160,G30>$G$160),\"Plow Horse\",\"Dog\"))),\"\")","v":"Dog"},{"$f":"IFERROR(IF(J30=\"\",D29,E30*J30),D29)","v":""},{"$f":"IFERROR(IF(K30=\"\",E29,K30*$F$3),E29)","v":0},{"$f":"IFERROR(D30*H30,F29)","v":""},{"$f":"IFERROR(IF(E30=\"\",G29,E30/$E$160),G29)","v":""},{"$f":"IFERROR(IF(L30=\"\",H29,L30/J30),H29)","v":""},{"$f":"IFERROR(J30-L30,\"\")","v":""},{"$f":"J29","v":""},"",""]
[]
["Baseline",{"$f":"'Cat 3 Setup'!A17","v":0},{"$f":"IFERROR(IF(AND(I32>$I$159,G32>$G$159),\"Star\",IF(AND(I32>$I$159,G32<$G$159),\"Puzzle\",IF(AND(I32<$I$159,G32>$G$159),\"Plow Horse\",\"Dog\"))),\"\")","v":"Dog"},{"$f":"IFERROR(VLOOKUP(B32,'Cat 3 Setup'!$A:$F,4,FALSE),\"\")","v":""},{"$f":"IFERROR(VLOOKUP(B32,'Cat 3 Setup'!$A:$F,3,FALSE),\"\")","v":0},{"$f":"IFERROR(VLOOKUP(B32,'Cat 3 Setup'!$A:$F,6,FALSE),\"\")","v":""},{"$f":"IFERROR(E32/$E$159,\"\")","v":""},{"$f":"IFERROR(F32/D32,\"\")","v":""},{"$f":"IFERROR(J32-L32,\"\")","v":""},{"$f":"IFERROR(D32/E32,\"\")","v":""},{"$f":"IFERROR(E32/$F$3,\"\")","v":""},{"$f":"IFERROR(J32*H32,\"\")","v":""}]
["Proposed",null,{"$f":"IFERROR(IF(AND(I33>$I$160,G33>$G$160),\"Star\",IF(AND(I33>$I$160,G33<$G$160),\"Puzzle\",IF(AND(I33<$I$160,G33>$G$160),\"Plow Horse\",\"Dog\"))),\"\")","v":"Dog"},{"$f":"IFERROR(IF(J33=\"\",D32,E33*J33),D32)","v":""},{"$f":"IFERROR(IF(K33=\"\",E32,K33*$F$3),E32)","v":0},{"$f":"IFERROR(D33*H33,F32)","v":""},{"$f":"IFERROR(IF(E33=\"\",G32,E33/$E$160),G32)","v":""},{"$f":"IFERROR(IF(L33=\"\",H32,L33/J33),H32)","v":""},{"$f":"IFERROR(J33-L33,\"\")","v":""},{"$f":"J32","v":""},"",""]
[]
["Baseline",{"$f":"'Cat 3 Setup'!A18","v":0},{"$f":"IFERROR(IF(AND(I35>$I$159,G35>$G$159),\"Star\",IF(AND(I35>$I$159,G35<$G$159),\"Puzzle\",IF(AND(I35<$I$159,G35>$G$159),\"Plow Horse\",\"Dog\"))),\"\")","v":"Dog"},{"$f":"IFERROR(VLOOKUP(B35,'Cat 3 Setup'!$A:$F,4,FALSE),\"\")","v":""},{"$f":"IFERROR(VLOOKUP(B35,'Cat 3 Setup'!$A:$F,3,FALSE),\"\")","v":0},{"$f":"IFERROR(VLOOKUP(B35,'Cat 3 Setup'!$A:$F,6,FALSE),\"\")","v":""},{"$f":"IFERROR(E35/$E$159,\"\")","v":""},{"$f":"IFERROR(F35/D35,\"\")","v":""},{"$f":"IFERROR(J35-L35,\"\")","v":""},{"$f":"IFERROR(D35/E35,\"\")","v":""},{"$f":"IFERROR(E35/$F$3,\"\")","v":""},{"$f":"IFERROR(J35*H35,\"\")","v":""}]
["Proposed",null,{"$f":"IFERROR(IF(AND(I36>$I$160,G36>$G$160),\"Star\",IF(AND(I36>$I$160,G36<$G$160),\"Puzzle\",IF(AND(I36<$I$160,G36>$G$160),\"Plow Horse\",\"Dog\"))),\"\")","v":"Dog"},{"$f":"IFERROR(IF(J36=\"\",D35,E36*J36),D35)","v":""},{"$f":"IFERROR(IF(K36=\"\",E35,K36*$F$3),E35)","v":0},{"$f":"IFERROR(D36*H36,F35)","v":""},{"$f":"IFERROR(IF(E36=\"\",G35,E36/$E$160),G35)","v":""},{"$f":"IFERROR(IF(L36=\"\",H35,L36/J36),H35)","v":""},{"$f":"IFERROR(J36-L36,\"\")","v":""},{"$f":"J35","v":""},"",""]
[]
["Baseline",{"$f":"'Cat 3 Setup'!A19","v":0},{"$f":"IFERROR(IF(AND(I38>$I$159,G38>$G$159),\"Star\",IF(AND(I38>$I$159,G38<$G$159),\"Puzzle\",IF(AND(I38<$I$159,G38>$G$159),\"Plow Horse\",\"Dog\"))),\"\")","v":"Dog"},{"$f":"IFERROR(VLOOKUP(B38,'Cat 3 Setup'!$A:$F,4,FALSE),\"\")","v":""},{"$f":"IFERROR(VLOOKUP(B38,'Cat 3 Setup'!$A:$F,3,FALSE),\"\")","v":0},{"$f":"IFERROR(VLOOKUP(B38,'Cat 3 Setup'!$A:$F,6,FALSE),\"\")","v":""},{"$f":"IFERROR(E38/$E$159,\"\")","v":""},{"$f":"IFERROR(F38/D38,\"\")","v":""},{"$f":"IFERROR(J38-L38,\"\")","v":""},{"$f":"IFERROR(D38/E38,\"\")","v":""},{"$f":"IFERROR(E38/$F$3,\"\")","v":""},{"$f":"IFERROR(J38*H38,\"\")","v":""}]
["Proposed",null,{"$f":"IFERROR(IF(AND(I39>$I$160,G39>$G$160),\"Star\",IF(AND(I39>$I$160,G39<$G$160),\"Puzzle\",IF(AND(I39<$I$160,G39>$G$160),\"Plow Horse\",\"Dog\"))),\"\")","v":"Dog"},{"$f":"IFERROR(IF(J39=\"\",D38,E39*J39),D38)","v":""},{"$f":"IFERROR(IF(K39=\"\",E38,K39*$F$3),E38)","v":0},{"$f":"IFERROR(D39*H39,F38)","v":""},{"$f":"IFERROR(IF(E39=\"\",G38,E39/$E$160),G38)","v":""},{"$f":"IFERROR(IF(L39=\"\",H38,L39/J39),H38)","v":""},{"$f":"IFERROR(J39-L39,\"\")","v":""},{"$f":"J38","v":""},"",""]
[]
["Baseline",{"$f":"'Cat 3 Setup'!A20","v":0},{"$f":"IFERROR(IF(AND(I41>$I$159,G41>$G$159),\"Star\",IF(AND(I41>$I$159,G41<$G$159),\"Puzzle\",IF(AND(I41<$I$159,G41>$G$159),\"Plow Horse\",\"Dog\"))),\"\")","v":"Dog"},{"$f":"IFERROR(VLOOKUP(B41,'Cat 3 Setup'!$A:$F,4,FALSE),\"\")","v":""},{"$f":"IFERROR(VLOOKUP(B41,'Cat 3 Setup'!$A:$F,3,FALSE),\"\")","v":0},{"$f":"IFERROR(VLOOKUP(B41,'Cat 3 Setup'!$A:$F,6,FALSE),\"\")","v":""},{"$f":"IFERROR(E41/$E$159,\"\")","v":""},{"$f":"IFERROR(F41/D41,\"\")","v":""},{"$f":"IFERROR(J41-L41,\"\")","v":""},{"$f":"IFERROR(D41/E41,\"\")","v":""},{"$f":"IFERROR(E41/$F$3,\"\")","v":""},{"$f":"IFERROR(J41*H41,\"\")","v":""}]
["Proposed",null,{"$f":"IFERROR(IF(AND(I42>$I$160,G42>$G$160),\"Star\",IF(AND(I42>$I$160,G42<$G$160),\"Puzzle\",IF(AND(I42<$I$160,G42>$G$160),\"Plow Horse\",\"Dog\"))),\"\")","v":"Dog"},{"$f":"IFERROR(IF(J42=\"\",D41,E42*J42),D41)","v":""},{"$f":"IFERROR(IF(K42=\"\",E41,K42*$F$3),E41)","v":0},{"$f":"IFERROR(D42*H42,F41)","v":""},{"$f":"IFERROR(IF(E42=\"\",G41,E42/$E$160),G41)","v":""},{"$f":"IFERROR(IF(L42=\"\",H41,L42/J42),H41)","v":""},{"$f":"IFERROR(J42-L42,\"\")","v":""},{"$f":"J41","v":""},"",""]
[]
["Baseline",{"$f":"'Cat 3 Setup'!A21","v":0},{"$f":"IFERROR(IF(AND(I44>$I$159,G44>$G$159),\"Star\",IF(AND(I44>$I$159,G44<$G$159),\"Puzzle\",IF(AND(I44<$I$159,G44>$G$159),\"Plow Horse\",\"Dog\"))),\"\")","v":"Dog"},{"$f":"IFERROR(VLOOKUP(B44,'Cat 3 Setup'!$A:$F,4,FALSE),\"\")","v":""},{"$f":"IFERROR(VLOOKUP(B44,'Cat 3 Setup'!$A:$F,3,FALSE),\"\")","v":0},{"$f":"IFERROR(VLOOKUP(B44,'Cat 3 Setup'!$A:$F,6,FALSE),\"\")","v":""},{"$f":"IFERROR(E44/$E$159,\"\")","v":""},{"$f":"IFERROR(F44/D44,\"\")","v":""},{"$f":"IFERROR(J44-L44,\"\")","v":""},{"$f":"IFERROR(D44/E44,\"\")","v":""},{"$f":"IFERROR(E44/$F$3,\"\")","v":""},{"$f":"IFERROR(J44*H44,\"\")","v":""}]
["Proposed",null,{"$f":"IFERROR(IF(AND(I45>$I$160,G45>$G$160),\"Star\",IF(AND(I45>$I$160,G45<$G$160),\"Puzzle\",IF(AND(I45<$I$160,G45>$G$160),\"Plow Horse\",\"Dog\"))),\"\")","v":"Dog"},{"$f":"IFERROR(IF(J45=\"\",D44,E45*J45),D44)","v":""},{"$f":"IFERROR(IF(K45=\"\",E44,K45*$F$3),E44)","v":0},{"$f":"IFERROR(D45*H45,F44)","v":""},{"$f":"IFERROR(IF(E45=\"\",G44,E45/$E$160),G44)","v":""},{"$f":"IFERROR(IF(L45=\"\",H44,L45/J45),H44)","v":""},{"$f":"IFERROR(J45-L45,\"\")","v":""},{"$f":"J44","v":""},"",""]
[]
["Baseline",{"$f":"'Cat 3 Setup'!A22","v":0},{"$f":"IFERROR(IF(AND(I47>$I$159,G47>$G$159),\"Star\",IF(AND(I47>$I$159,G47<$G$159),\"Puzzle\",IF(AND(I47<$I$159,G47>$G$159),\"Plow Horse\",\"Dog\"))),\"\")","v":"Dog"},{"$f":"IFERROR(VLOOKUP(B47,'Cat 3 Setup'!$A:$F,4,FALSE),\"\")","v":""},{"$f":"IFERROR(VLOOKUP(B47,'Cat 3 Setup'!$A:$F,3,FALSE),\"\")","v":0},{"$f":"IFERROR(VLOOKUP(B47,'Cat 3 Setup'!$A:$F,6,FALSE),\"\")","v":""},{"$f":"IFERROR(E47/$E$159,\"\")","v":""},{"$f":"IFERROR(F47/D47,\"\")","v":""},{"$f":"IFERROR(J47-L47,\"\")","v":""},{"$f":"IFERROR(D47/E47,\"\")","v":""},{"$f":"IFERROR(E47/$F$3,\"\")","v":""},{"$f":"IFERROR(J47*H47,\"\")","v":""}]
["Proposed",null,{"$f":"IFERROR(IF(AND(I48>$I$160,G48>$G$160),\"Star\",IF(AND(I48>$I$160,G48<$G$160),\"Puzzle\",IF(AND(I48<$I$160,G48>$G$160),\"Plow Horse\",\"Dog\"))),\"\")","v":"Dog"},{"$f":"IFERROR(IF(J48=\"\",D47,E48*J48),D47)","v":""},{"$f":"IFERROR(IF(K48=\"\",E47,K48*$F$3),E47)","v":0},{"$f":"IFERROR(D48*H48,F47)","v":""},{"$f":"IFERROR(IF(E48=\"\",G47,E48/$E$160),G47)","v":""},{"$f":"IFERROR(IF(L48=\"\",H47,L48/J48),H47)","v":""},{"$f":"IFERROR(J48-L48,\"\")","v":""},{"$f":"J47","v":""},"",""]
[]
["Baseline",{"$f":"'Cat 3 Setup'!A23","v":0},{"$f":"IFERROR(IF(AND(I50>$I$159,G50>$G$159),\"Star\",IF(AND(I50>$I$159,G50<$G$159),\"Puzzle\",IF(AND(I50<$I$159,G50>$G$159),\"Plow Horse\",\"Dog\"))),\"\")","v":"Dog"},{"$f":"IFERROR(VLOOKUP(B50,'Cat 3 Setup'!$A:$F,4,FALSE),\"\")","v":""},{"$f":"IFERROR(VLOOKUP(B50,'Cat 3 Setup'!$A:$F,3,FALSE),\"\")","v":0},{"$f":"IFERROR(VLOOKUP(B50,'Cat 3 Setup'!$A:$F,6,FALSE),\"\")","v":""},{"$f":"IFERROR(E50/$E$159,\"\")","v":""},{"$f":"IFERROR(F50/D50,\"\")","v":""},{"$f":"IFERROR(J50-L50,\"\")","v":""},{"$f":"IFERROR(D50/E50,\"\")","v":""},{"$f":"IFERROR(E50/$F$3,\"\")","v":""},{"$f":"IFERROR(J50*H50,\"\")","v":""}]
["Proposed",null,{"$f":"IFERROR(IF(AND(I51>$I$160,G51>$G$160),\"Star\",IF(AND(I51>$I$160,G51<$G$160),\"Puzzle\",IF(AND(I51<$I$160,G51>$G$160),\"Plow Horse\",\"Dog\"))),\"\")","v":"Dog"},{"$f":"IFERROR(IF(J51=\"\",D50,E51*J51),D50)","v":""},{"$f":"IFERROR(IF(K51=\"\",E50,K51*$F$3),E50)","v":0},{"$f":"IFERROR(D51*H51,F50)","v":""},{"$f":"IFERROR(IF(E51=\"\",G50,E51/$E$160),G50)","v":""},{"$f":"IFERROR(IF(L51=\"\",H50,L51/J51),H50)","v":""},{"$f":"IFERROR(J51-L51,\"\")","v":""},{"$f":"J50","v":""},"",""]
[]
["Baseline",{"$f":"'Cat 3 Setup'!A24","v":0},{"$f":"IFERROR(IF(AND(I53>$I$159,G53>$G$159),\"Star\",IF(AND(I53>$I$159,G53<$G$159),\"Puzzle\",IF(AND(I53<$I$159,G53>$G$159),\"Plow Horse\",\"Dog\"))),\"\")","v":"Dog"},{"$f":"IFERROR(VLOOKUP(B53,'Cat 3 Setup'!$A:$F,4,FALSE),\"\")","v":""},{"$f":"IFERROR(VLOOKUP(B53,'Cat 3 Setup'!$A:$F,3,FALSE),\"\")","v":0},{"$f":"IFERROR(VLOOKUP(B53,'Cat 3 Setup'!$A:$F,6,FALSE),\"\")","v":""},{"$f":"IFERROR(E53/$E$159,\"\")","v":""},{"$f":"IFERROR(F53/D53,\"\")","v":""},{"$f":"IFERROR(J53-L53,\"\")","v":""},{"$f":"IFERROR(D53/E53,\"\")","v":""},{"$f":"IFERROR(E53/$F$3,\"\")","v":""},{"$f":"IFERROR(J53*H53,\"\")","v":""}]
["Proposed",null,{"$f":"IFERROR(IF(AND(I54>$I$160,G54>$G$160),\"Star\",IF(AND(I54>$I$160,G54<$G$160),\"Puzzle\",IF(AND(I54<$I$160,G54>$G$160),\"Plow Horse\",\"Dog\"))),\"\")","v":"Dog"},{"$f":"IFERROR(IF(J54=\"\",D53,E54*J54),D53)","v":""},{"$f":"IFERROR(IF(K54=\"\",E53,K54*$F$3),E53)","v":0},{"$f":"IFERROR(D54*H54,F53)","v":""},{"$f":"IFERROR(IF(E54=\"\",G53,E54/$E$160),G53)","v":""},{"$f":"IFERROR(IF(L54=\"\",H53,L54/J54),H53)","v":""},{"$f":"IFERROR(J54-L54,\"\")","v":""},{"$f":"J53","v":""},"",""]
[]
["Baseline",{"$f":"'Cat 3 Setup'!A25","v":0},{"$f":"IFERROR(IF(AND(I56>$I$159,G56>$G$159),\"Star\",IF(AND(I56>$I$159,G56<$G$159),\"Puzzle\",IF(AND(I56<$I$159,G56>$G$159),\"Plow Horse\",\"Dog\"))),\"\")","v":"Dog"},{"$f":"IFERROR(VLOOKUP(B56,'Cat 3 Setup'!$A:$F,4,FALSE),\"\")","v":""},{"$f":"IFERROR(VLOOKUP(B56,'Cat 3 Setup'!$A:$F,3,FALSE),\"\")","v":0},{"$f":"IFERROR(VLOOKUP(B56,'Cat 3 Setup'!$A:$F,6,FALSE),\"\")","v":""},{"$f":"IFERROR(E56/$E$159,\"\")","v":""},{"$f":"IFERROR(F56/D56,\"\")","v":""},{"$f":"IFERROR(J56-L56,\"\")","v":""},{"$f":"IFERROR(D56/E56,\"\")","v":""},{"$f":"IFERROR(E56/$F$3,\"\")","v":""},{"$f":"IFERROR(J56*H56,\"\")","v":""}]
["Proposed",null,{"$f":"IFERROR(IF(AND(I57>$I$160,G57>$G$160),\"Star\",IF(AND(I57>$I$160,G57<$G$160),\"Puzzle\",IF(AND(I57<$I$160,G57>$G$160),\"Plow Horse\",\"Dog\"))),\"\")","v":"Dog"},{"$f":"IFERROR(IF(J57=\"\",D56,E57*J57),D56)","v":""},{"$f":"IFERROR(IF(K57=\"\",E56,K57*$F$3),E56)","v":0},{"$f":"IFERROR(D57*H57,F56)","v":""},{"$f":"IFERROR(IF(E57=\"\",G56,E57/$E$160),G56)","v":""},{"$f":"IFERROR(IF(L57=\"\",H56,L57/J57),H56)","v":""},{"$f":"IFERROR(J57-L57,\"\")","v":""},{"$f":"J56","v":""},"",""]
[]
["Baseline",{"$f":"'Cat 3 Setup'!A26","v":0},{"$f":"IFERROR(IF(AND(I59>$I$159,G59>$G$159),\"Star\",IF(AND(I59>$I$159,G59<$G$159),\"Puzzle\",IF(AND(I59<$I$159,G59>$G$159),\"Plow Horse\",\"Dog\"))),\"\")","v":"Dog"},{"$f":"IFERROR(VLOOKUP(B59,'Cat 3 Setup'!$A:$F,4,FALSE),\"\")","v":""},{"$f":"IFERROR(VLOOKUP(B59,'Cat 3 Setup'!$A:$F,3,FALSE),\"\")","v":0},{"$f":"IFERROR(VLOOKUP(B59,'Cat 3 Setup'!$A:$F,6,FALSE),\"\")","v":""},{"$f":"IFERROR(E59/$E$159,\"\")","v":""},{"$f":"IFERROR(F59/D59,\"\")","v":""},{"$f":"IFERROR(J59-L59,\"\")","v":""},{"$f":"IFERROR(D59/E59,\"\")","v":""},{"$f":"IFERROR(E59/$F$3,\"\")","v":""},{"$f":"IFERROR(J59*H59,\"\")","v":""}]
["Proposed",null,{"$f":"IFERROR(IF(AND(I60>$I$160,G60>$G$160),\"Star\",IF(AND(I60>$I$160,G60<$G$160),\"Puzzle\",IF(AND(I60<$I$160,G60>$G$160),\"Plow Horse\",\"Dog\"))),\"\")","v":"Dog"},{"$f":"IFERROR(IF(J60=\"\",D59,E60*J60),D59)","v":""},{"$f":"IFERROR(IF(K60=\"\",E59,K60*$F$3),E59)","v":0},{"$f":"IFERROR(D60*H60,F59)","v":""},{"$f":"IFERROR(IF(E60=\"\",G59,E60/$E$160),G59)","v":""},{"$f":"IFERROR(IF(L60=\"\",H59,L60/J60),H59)","v":""},{"$f":"IFERROR(J60-L60,\"\")","v":""},{"$f":"J59","v":""},"",""]
[]
["Baseline",{"$f":"'Cat 3 Setup'!A27","v":0},{"$f":"IFERROR(IF(AND(I62>$I$159,G62>$G$159),\"Star\",IF(AND(I62>$I$159,G62<$G$159),\"Puzzle\",IF(AND(I62<$I$159,G62>$G$159),\"Plow Horse\",\"Dog\"))),\"\")","v":"Dog"},{"$f":"IFERROR(VLOOKUP(B62,'Cat 3 Setup'!$A:$F,4,FALSE),\"\")","v":""},{"$f":"IFERROR(VLOOKUP(B62,'Cat 3 Setup'!$A:$F,3,FALSE),\"\")","v":0},{"$f":"IFERROR(VLOOKUP(B62,'Cat 3 Setup'!$A:$F,6,FALSE),\"\")","v":""},{"$f":"IFERROR(E62/$E$159,\"\")","v":""},{"$f":"IFERROR(F62/D62,\"\")","v":""},{"$f":"IFERROR(J62-L62,\"\")","v":""},{"$f":"IFERROR(D62/E62,\"\")","v":""},{"$f":"IFERROR(E62/$F$3,\"\")","v":""},{"$f":"IFERROR(J62*H62,\"\")","v":""}]
["Proposed",null,{"$f":"IFERROR(IF(AND(I63>$I$160,G63>$G$160),\"Star\",IF(AND(I63>$I$160,G63<$G$160),\"Puzzle\",IF(AND(I63<$I$160,G63>$G$160),\"Plow Horse\",\"Dog\"))),\"\")","v":"Dog"},{"$f":"IFERROR(IF(J63=\"\",D62,E63*J63),D62)","v":""},{"$f":"IFERROR(IF(K63=\"\",E62,K63*$F$3),E62)","v":0},{"$f":"IFERROR(D63*H63,F62)","v":""},{"$f":"IFERROR(IF(E63=\"\",G62,E63/$E$160),G62)","v":""},{"$f":"IFERROR(IF(L63=\"\",H62,L63/J63),H62)","v":""},{"$f":"IFERROR(J63-L63,\"\")","v":""},{"$f":"J62","v":""},"",""]
[]
["Baseline",{"$f":"'Cat 3 Setup'!A28","v":0},{"$f":"IFERROR(IF(AND(I65>$I$159,G65>$G$159),\"Star\",IF(AND(I65>$I$159,G65<$G$159),\"Puzzle\",IF(AND(I65<$I$159,G65>$G$159),\"Plow Horse\",\"Dog\"))),\"\")","v":"Dog"},{"$f":"IFERROR(VLOOKUP(B65,'Cat 3 Setup'!$A:$F,4,FALSE),\"\")","v":""},{"$f":"IFERROR(VLOOKUP(B65,'Cat 3 Setup'!$A:$F,3,FALSE),\"\")","v":0},{"$f":"IFERROR(VLOOKUP(B65,'Cat 3 Setup'!$A:$F,6,FALSE),\"\")","v":""},{"$f":"IFERROR(E65/$E$159,\"\")","v":""},{"$f":"IFERROR(F65/D65,\"\")","v":""},{"$f":"IFERROR(J65-L65,\"\")","v":""},{"$f":"IFERROR(D65/E65,\"\")","v":""},{"$f":"IFERROR(E65/$F$3,\"\")","v":""},{"$f":"IFERROR(J65*H65,\"\")","v":""}]
["Proposed",null,{"$f":"IFERROR(IF(AND(I66>$I$160,G66>$G$160),\"Star\",IF(AND(I66>$I$160,G66<$G$160),\"Puzzle\",IF(AND(I66<$I$160,G66>$G$160),\"Plow Horse\",\"Dog\"))),\"\")","v":"Dog"},{"$f":"IFERROR(IF(J66=\"\",D65,E66*J66),D65)","v":""},{"$f":"IFERROR(IF(K66=\"\",E65,K66*$F$3),E65)","v":0},{"$f":"IFERROR(D66*H66,F65)","v":""},{"$f":"IFERROR(IF(E66=\"\",G65,E66/$E$160),G65)","v":""},{"$f":"IFERROR(IF(L66=\"\",H65,L66/J66),H65)","v":""},{"$f":"IFERROR(J66-L66,\"\")","v":""},{"$f":"J65","v":""},"",""]
[]
["Baseline",{"$f":"'Cat 3 Setup'!A29","v":0},{"$f":"IFERROR(IF(AND(I68>$I$159,G68>$G$159),\"Star\",IF(AND(I68>$I$159,G68<$G$159),\"Puzzle\",IF(AND(I68<$I$159,G68>$G$159),\"Plow Horse\",\"Dog\"))),\"\")","v":"Dog"},{"$f":"IFERROR(VLOOKUP(B68,'Cat 3 Setup'!$A:$F,4,FALSE),\"\")","v":""},{"$f":"IFERROR(VLOOKUP(B68,'Cat 3 Setup'!$A:$F,3,FALSE),\"\")","v":0},{"$f":"IFERROR(VLOOKUP(B68,'Cat 3 Setup'!$A:$F,6,FALSE),\"\")","v":""},{"$f":"IFERROR(E68/$E$159,\"\")","v":""},{"$f":"IFERROR(F68/D68,\"\")","v":""},{"$f":"IFERROR(J68-L68,\"\")","v":""},{"$f":"IFERROR(D68/E68,\"\")","v":""},{"$f":"IFERROR(E68/$F$3,\"\")","v":""},{"$f":"IFERROR(J68*H68,\"\")","v":""}]
["Proposed",null,{"$f":"IFERROR(IF(AND(I69>$I$160,G69>$G$160),\"Star\",IF(AND(I69>$I$160,G69<$G$160),\"Puzzle\",IF(AND(I69<$I$160,G69>$G$160),\"Plow Horse\",\"Dog\"))),\"\")","v":"Dog"},{"$f":"IFERROR(IF(J69=\"\",D68,E69*J69),D68)","v":""},{"$f":"IFERROR(IF(K69=\"\",E68,K69*$F$3),E68)","v":0},{"$f":"IFERROR(D69*H69,F68)","v":""},{"$f":"IFERROR(IF(E69=\"\",G68,E69/$E$160),G68)","v":""},{"$f":"IFERROR(IF(L69=\"\",H68,L69/J69),H68)","v":""},{"$f":"IFERROR(J69-L69,\"\")","v":""},{"$f":"J68","v":""},"",""]
[]
["Baseline",{"$f":"'Cat 3 Setup'!A30","v":0},{"$f":"IFERROR(IF(AND(I71>$I$159,G71>$G$159),\"Star\",IF(AND(I71>$I$159,G71<$G$159),\"Puzzle\",IF(AND(I71<$I$159,G71>$G$159),\"Plow Horse\",\"Dog\"))),\"\")","v":"Dog"},{"$f":"IFERROR(VLOOKUP(B71,'Cat 3 Setup'!$A:$F,4,FALSE),\"\")","v":""},{"$f":"IFERROR(VLOOKUP(B71,'Cat 3 Setup'!$A:$F,3,FALSE),\"\")","v":0},{"$f":"IFERROR(VLOOKUP(B71,'Cat 3 Setup'!$A:$F,6,FALSE),\"\")","v":""},{"$f":"IFERROR(E71/$E$159,\"\")","v":""},{"$f":"IFERROR(F71/D71,\"\")","v":""},{"$f":"IFERROR(J71-L71,\"\")","v":""},{"$f":"IFERROR(D71/E71,\"\")","v":""},{"$f":"IFERROR(E71/$F$3,\"\")","v":""},{"$f":"IFERROR(J71*H71,\"\")","v":""}]
["Proposed",null,{"$f":"IFERROR(IF(AND(I72>$I$160,G72>$G$160),\"Star\",IF(AND(I72>$I$160,G72<$G$160),\"Puzzle\",IF(AND(I72<$I$160,G72>$G$160),\"Plow Horse\",\"Dog\"))),\"\")","v":"Dog"},{"$f":"IFERROR(IF(J72=\"\",D71,E72*J72),D71)","v":""},{"$f":"IFERROR(IF(K72=\"\",E71,K72*$F$3),E71)","v":0},{"$f":"IFERROR(D72*H72,F71)","v":""},{"$f":"IFERROR(IF(E72=\"\",G71,E72/$E$160),G71)","v":""},{"$f":"IFERROR(IF(L72=\"\",H71,L72/J72),H71)","v":""},{"$f":"IFERROR(J72-L72,\"\")","v":""},{"$f":"J71","v":""},"",""]
[]
["Baseline",{"$f":"'Cat 3 Setup'!A31","v":0},{"$f":"IFERROR(IF(AND(I74>$I$159,G74>$G$159),\"Star\",IF(AND(I74>$I$159,G74<$G$159),\"Puzzle\",IF(AND(I74<$I$159,G74>$G$159),\"Plow Horse\",\"Dog\"))),\"\")","v":"Dog"},{"$f":"IFERROR(VLOOKUP(B74,'Cat 3 Setup'!$A:$F,4,FALSE),\"\")","v":""},{"$f":"IFERROR(VLOOKUP(B74,'Cat 3 Setup'!$A:$F,3,FALSE),\"\")","v":0},{"$f":"IFERROR(VLOOKUP(B74,'Cat 3 Setup'!$A:$F,6,FALSE),\"\")","v":""},{"$f":"IFERROR(E74/$E$159,\"\")","v":""},{"$f":"IFERROR(F74/D74,\"\")","v":""},{"$f":"IFERROR(J74-L74,\"\")","v":""},{"$f":"IFERROR(D74/E74,\"\")","v":""},{"$f":"IFERROR(E74/$F$3,\"\")","v":""},{"$f":"IFERROR(J74*H74,\"\")","v":""}]
["Proposed",null,{"$f":"IFERROR(IF(AND(I75>$I$160,G75>$G$160),\"Star\",IF(AND(I75>$I$160,G75<$G$160),\"Puzzle\",IF(AND(I75<$I$160,G75>$G$160),\"Plow Horse\",\"Dog\"))),\"\")","v":"Dog"},{"$f":"IFERROR(IF(J75=\"\",D74,E75*J75),D74)","v":""},{"$f":"IFERROR(IF(K75=\"\",E74,K75*$F$3),E74)","v":0},{"$f":"IFERROR(D75*H75,F74)","v":""},{"$f":"IFERROR(IF(E75=\"\",G74,E75/$E$160),G74)","v":""},{"$f":"IFERROR(IF(L75=\"\",H74,L75/J75),H74)","v":""},{"$f":"IFERROR(J75-L75,\"\")","v":""},{"$f":"J74","v":""},"",""]
[]
["Baseline",{"$f":"'Cat 3 Setup'!A32","v":0},{"$f":"IFERROR(IF(AND(I77>$I$159,G77>$G$159),\"Star\",IF(AND(I77>$I$159,G77<$G$159),\"Puzzle\",IF(AND(I77<$I$159,G77>$G$159),\"Plow Horse\",\"Dog\"))),\"\")","v":"Dog"},{"$f":"IFERROR(VLOOKUP(B77,'Cat 3 Setup'!$A:$F,4,FALSE),\"\")","v":""},{"$f":"IFERROR(VLOOKUP(B77,'Cat 3 Setup'!$A:$F,3,FALSE),\"\")","v":0},{"$f":"IFERROR(VLOOKUP(B77,'Cat 3 Setup'!$A:$F,6,FALSE),\"\")","v":""},{"$f":"IFERROR(E77/$E$159,\"\")","v":""},{"$f":"IFERROR(F77/D77,\"\")","v":""},{"$f":"IFERROR(J77-L77,\"\")","v":""},{"$f":"IFERROR(D77/E77,\"\")","v":""},{"$f":"IFERROR(E77/$F$3,\"\")","v":""},{"$f":"IFERROR(J77*H77,\"\")","v":""}]
["Proposed",null,{"$f":"IFERROR(IF(AND(I78>$I$160,G78>$G$160),\"Star\",IF(AND(I78>$I$160,G78<$G$160),\"Puzzle\",IF(AND(I78<$I$160,G78>$G$160),\"Plow Horse\",\"Dog\"))),\"\")","v":"Dog"},{"$f":"IFERROR(IF(J78=\"\",D77,E78*J78),D77)","v":""},{"$f":"IFERROR(IF(K78=\"\",E77,K78*$F$3),E77)","v":0},{"$f":"IFERROR(D78*H78,F77)","v":""},{"$f":"IFERROR(IF(E78=\"\",G77,E78/$E$160),G77)","v":""},{"$f":"IFERROR(IF(L78=\"\",H77,L78/J78),H77)","v":""},{"$f":"IFERROR(J78-L78,\"\")","v":""},{"$f":"J77","v":""},"",""]
[]
["Baseline",{"$f":"'Cat 3 Setup'!A33","v":0},{"$f":"IFERROR(IF(AND(I80>$I$159,G80>$G$159),\"Star\",IF(AND(I80>$I$159,G80<$G$159),\"Puzzle\",IF(AND(I80<$I$159,G80>$G$159),\"Plow Horse\",\"Dog\"))),\"\")","v":"Dog"},{"$f":"IFERROR(VLOOKUP(B80,'Cat 3 Setup'!$A:$F,4,FALSE),\"\")","v":""},{"$f":"IFERROR(VLOOKUP(B80,'Cat 3 Setup'!$A:$F,3,FALSE),\"\")","v":0},{"$f":"IFERROR(VLOOKUP(B80,'Cat 3 Setup'!$A:$F,6,FALSE),\"\")","v":""},{"$f":"IFERROR(E80/$E$159,\"\")","v":""},{"$f":"IFERROR(F80/D80,\"\")","v":""},{"$f":"IFERROR(J80-L80,\"\")","v":""},{"$f":"IFERROR(D80/E80,\"\")","v":""},{"$f":"IFERROR(E80/$F$3,\"\")","v":""},{"$f":"IFERROR(J80*H80,\"\")","v":""}]
["Proposed",null,{"$f":"IFERROR(IF(AND(I81>$I$160,G81>$G$160),\"Star\",IF(AND(I81>$I$160,G81<$G$160),\"Puzzle\",IF(AND(I81<$I$160,G81>$G$160),\"Plow Horse\",\"Dog\"))),\"\")","v":"Dog"},{"$f":"IFERROR(IF(J81=\"\",D80,E81*J81),D80)","v":""},{"$f":"IFERROR(IF(K81=\"\",E80,K81*$F$3),E80)","v":0},{"$f":"IFERROR(D81*H81,F80)","v":""},{"$f":"IFERROR(IF(E81=\"\",G80,E81/$E$160),G80)","v":""},{"$f":"IFERROR(IF(L81=\"\",H80,L81/J81),H80)","v":""},{"$f":"IFERROR(J81-L81,\"\")","v":""},{"$f":"J80","v":""},"",""]
[]
["Baseline",{"$f":"'Cat 3 Setup'!A34","v":0},{"$f":"IFERROR(IF(AND(I83>$I$159,G83>$G$159),\"Star\",IF(AND(I83>$I$159,G83<$G$159),\"Puzzle\",IF(AND(I83<$I$159,G83>$G$159),\"Plow Horse\",\"Dog\"))),\"\")","v":"Dog"},{"$f":"IFERROR(VLOOKUP(B83,'Cat 3 Setup'!$A:$F,4,FALSE),\"\")","v":""},{"$f":"IFERROR(VLOOKUP(B83,'Cat 3 Setup'!$A:$F,3,FALSE),\"\")","v":0},{"$f":"IFERROR(VLOOKUP(B83,'Cat 3 Setup'!$A:$F,6,FALSE),\"\")","v":""},{"$f":"IFERROR(E83/$E$159,\"\")","v":""},{"$f":"IFERROR(F83/D83,\"\")","v":""},{"$f":"IFERROR(J83-L83,\"\")","v":""},{"$f":"IFERROR(D83/E83,\"\")","v":""},{"$f":"IFERROR(E83/$F$3,\"\")","v":""},{"$f":"IFERROR(J83*H83,\"\")","v":""}]
["Proposed",null,{"$f":"IFERROR(IF(AND(I84>$I$160,G84>$G$160),\"Star\",IF(AND(I84>$I$160,G84<$G$160),\"Puzzle\",IF(AND(I84<$I$160,G84>$G$160),\"Plow Horse\",\"Dog\"))),\"\")","v":"Dog"},{"$f":"IFERROR(IF(J84=\"\",D83,E84*J84),D83)","v":""},{"$f":"IFERROR(IF(K84=\"\",E83,K84*$F$3),E83)","v":0},{"$f":"IFERROR(D84*H84,F83)","v":""},{"$f":"IFERROR(IF(E84=\"\",G83,E84/$E$160),G83)","v":""},{"$f":"IFERROR(IF(L84=\"\",H83,L84/J84),H83)","v":""},{"$f":"IFERROR(J84-L84,\"\")","v":""},{"$f":"J83","v":""},"",""]
[]
["Baseline",{"$f":"'Cat 3 Setup'!A35","v":0},{"$f":"IFERROR(IF(AND(I86>$I$159,G86>$G$159),\"Star\",IF(AND(I86>$I$159,G86<$G$159),\"Puzzle\",IF(AND(I86<$I$159,G86>$G$159),\"Plow Horse\",\"Dog\"))),\"\")","v":"Dog"},{"$f":"IFERROR(VLOOKUP(B86,'Cat 3 Setup'!$A:$F,4,FALSE),\"\")","v":""},{"$f":"IFERROR(VLOOKUP(B86,'Cat 3 Setup'!$A:$F,3,FALSE),\"\")","v":0},{"$f":"IFERROR(VLOOKUP(B86,'Cat 3 Setup'!$A:$F,6,FALSE),\"\")","v":""},{"$f":"IFERROR(E86/$E$159,\"\")","v":""},{"$f":"IFERROR(F86/D86,\"\")","v":""},{"$f":"IFERROR(J86-L86,\"\")","v":""},{"$f":"IFERROR(D86/E86,\"\")","v":""},{"$f":"IFERROR(E86/$F$3,\"\")","v":""},{"$f":"IFERROR(J86*H86,\"\")","v":""}]
["Proposed",null,{"$f":"IFERROR(IF(AND(I87>$I$160,G87>$G$160),\"Star\",IF(AND(I87>$I$160,G87<$G$160),\"Puzzle\",IF(AND(I87<$I$160,G87>$G$160),\"Plow Horse\",\"Dog\"))),\"\")","v":"Dog"},{"$f":"IFERROR(IF(J87=\"\",D86,E87*J87),D86)","v":""},{"$f":"IFERROR(IF(K87=\"\",E86,K87*$F$3),E86)","v":0},{"$f":"IFERROR(D87*H87,F86)","v":""},{"$f":"IFERROR(IF(E87=\"\",G86,E87/$E$160),G86)","v":""},{"$f":"IFERROR(IF(L87=\"\",H86,L87/J87),H86)","v":""},{"$f":"IFERROR(J87-L87,\"\")","v":""},{"$f":"J86","v":""},"",""]
[]
["Baseline",{"$f":"'Cat 3 Setup'!A36","v":0},{"$f":"IFERROR(IF(AND(I89>$I$159,G89>$G$159),\"Star\",IF(AND(I89>$I$159,G89<$G$159),\"Puzzle\",IF(AND(I89<$I$159,G89>$G$159),\"Plow Horse\",\"Dog\"))),\"\")","v":"Dog"},{"$f":"IFERROR(VLOOKUP(B89,'Cat 3 Setup'!$A:$F,4,FALSE),\"\")","v":""},{"$f":"IFERROR(VLOOKUP(B89,'Cat 3 Setup'!$A:$F,3,FALSE),\"\")","v":0},{"$f":"IFERROR(VLOOKUP(B89,'Cat 3 Setup'!$A:$F,6,FALSE),\"\")","v":""},{"$f":"IFERROR(E89/$E$159,\"\")","v":""},{"$f":"IFERROR(F89/D89,\"\")","v":""},{"$f":"IFERROR(J89-L89,\"\")","v":""},{"$f":"IFERROR(D89/E89,\"\")","v":""},{"$f":"IFERROR(E89/$F$3,\"\")","v":""},{"$f":"IFERROR(J89*H89,\"\")","v":""}]
["Proposed",null,{"$f":"IFERROR(IF(AND(I90>$I$160,G90>$G$160),\"Star\",IF(AND(I90>$I$160,G90<$G$160),\"Puzzle\",IF(AND(I90<$I$160,G90>$G$160),\"Plow Horse\",\"Dog\"))),\"\")","v":"Dog"},{"$f":"IFERROR(IF(J90=\"\",D89,E90*J90),D89)","v":""},{"$f":"IFERROR(IF(K90=\"\",E89,K90*$F$3),E89)","v":0},{"$f":"IFERROR(D90*H90,F89)","v":""},{"$f":"IFERROR(IF(E90=\"\",G89,E90/$E$160),G89)","v":""},{"$f":"IFERROR(IF(L90=\"\",H89,L90/J90),H89)","v":""},{"$f":"IFERROR(J90-L90,\"\")","v":""},{"$f":"J89","v":""},"",""]
[]
["Baseline",{"$f":"'Cat 3 Setup'!A37","v":0},{"$f":"IFERROR(IF(AND(I92>$I$159,G92>$G$159),\"Star\",IF(AND(I92>$I$159,G92<$G$159),\"Puzzle\",IF(AND(I92<$I$159,G92>$G$159),\"Plow Horse\",\"Dog\"))),\"\")","v":"Dog"},{"$f":"IFERROR(VLOOKUP(B92,'Cat 3 Setup'!$A:$F,4,FALSE),\"\")","v":""},{"$f":"IFERROR(VLOOKUP(B92,'Cat 3 Setup'!$A:$F,3,FALSE),\"\")","v":0},{"$f":"IFERROR(VLOOKUP(B92,'Cat 3 Setup'!$A:$F,6,FALSE),\"\")","v":""},{"$f":"IFERROR(E92/$E$159,\"\")","v":""},{"$f":"IFERROR(F92/D92,\"\")","v":""},{"$f":"IFERROR(J92-L92,\"\")","v":""},{"$f":"IFERROR(D92/E92,\"\")","v":""},{"$f":"IFERROR(E92/$F$3,\"\")","v":""},{"$f":"IFERROR(J92*H92,\"\")","v":""}]
["Proposed",null,{"$f":"IFERROR(IF(AND(I93>$I$160,G93>$G$160),\"Star\",IF(AND(I93>$I$160,G93<$G$160),\"Puzzle\",IF(AND(I93<$I$160,G93>$G$160),\"Plow Horse\",\"Dog\"))),\"\")","v":"Dog"},{"$f":"IFERROR(IF(J93=\"\",D92,E93*J93),D92)","v":""},{"$f":"IFERROR(IF(K93=\"\",E92,K93*$F$3),E92)","v":0},{"$f":"IFERROR(D93*H93,F92)","v":""},{"$f":"IFERROR(IF(E93=\"\",G92,E93/$E$160),G92)","v":""},{"$f":"IFERROR(IF(L93=\"\",H92,L93/J93),H92)","v":""},{"$f":"IFERROR(J93-L93,\"\")","v":""},{"$f":"J92","v":""},"",""]
[]
["Baseline",{"$f":"'Cat 3 Setup'!A38","v":0},{"$f":"IFERROR(IF(AND(I95>$I$159,G95>$G$159),\"Star\",IF(AND(I95>$I$159,G95<$G$159),\"Puzzle\",IF(AND(I95<$I$159,G95>$G$159),\"Plow Horse\",\"Dog\"))),\"\")","v":"Dog"},{"$f":"IFERROR(VLOOKUP(B95,'Cat 3 Setup'!$A:$F,4,FALSE),\"\")","v":""},{"$f":"IFERROR(VLOOKUP(B95,'Cat 3 Setup'!$A:$F,3,FALSE),\"\")","v":0},{"$f":"IFERROR(VLOOKUP(B95,'Cat 3 Setup'!$A:$F,6,FALSE),\"\")","v":""},{"$f":"IFERROR(E95/$E$159,\"\")","v":""},{"$f":"IFERROR(F95/D95,\"\")","v":""},{"$f":"IFERROR(J95-L95,\"\")","v":""},{"$f":"IFERROR(D95/E95,\"\")","v":""},{"$f":"IFERROR(E95/$F$3,\"\")","v":""},{"$f":"IFERROR(J95*H95,\"\")","v":""}]
["Proposed",null,{"$f":"IFERROR(IF(AND(I96>$I$160,G96>$G$160),\"Star\",IF(AND(I96>$I$160,G96<$G$160),\"Puzzle\",IF(AND(I96<$I$160,G96>$G$160),\"Plow Horse\",\"Dog\"))),\"\")","v":"Dog"},{"$f":"IFERROR(IF(J96=\"\",D95,E96*J96),D95)","v":""},{"$f":"IFERROR(IF(K96=\"\",E95,K96*$F$3),E95)","v":0},{"$f":"IFERROR(D96*H96,F95)","v":""},{"$f":"IFERROR(IF(E96=\"\",G95,E96/$E$160),G95)","v":""},{"$f":"IFERROR(IF(L96=\"\",H95,L96/J96),H95)","v":""},{"$f":"IFERROR(J96-L96,\"\")","v":""},{"$f":"J95","v":""},"",""]
[]
["Baseline",{"$f":"'Cat 3 Setup'!A39","v":0},{"$f":"IFERROR(IF(AND(I98>$I$159,G98>$G$159),\"Star\",IF(AND(I98>$I$159,G98<$G$159),\"Puzzle\",IF(AND(I98<$I$159,G98>$G$159),\"Plow Horse\",\"Dog\"))),\"\")","v":"Dog"},{"$f":"IFERROR(VLOOKUP(B98,'Cat 3 Setup'!$A:$F,4,FALSE),\"\")","v":""},{"$f":"IFERROR(VLOOKUP(B98,'Cat 3 Setup'!$A:$F,3,FALSE),\"\")","v":0},{"$f":"IFERROR(VLOOKUP(B98,'Cat 3 Setup'!$A:$F,6,FALSE),\"\")","v":""},{"$f":"IFERROR(E98/$E$159,\"\")","v":""},{"$f":"IFERROR(F98/D98,\"\")","v":""},{"$f":"IFERROR(J98-L98,\"\")","v":""},{"$f":"IFERROR(D98/E98,\"\")","v":""},{"$f":"IFERROR(E98/$F$3,\"\")","v":""},{"$f":"IFERROR(J98*H98,\"\")","v":""}]
["Proposed",null,{"$f":"IFERROR(IF(AND(I99>$I$160,G99>$G$160),\"Star\",IF(AND(I99>$I$160,G99<$G$160),\"Puzzle\",IF(AND(I99<$I$160,G99>$G$160),\"Plow Horse\",\"Dog\"))),\"\")","v":"Dog"},{"$f":"IFERROR(IF(J99=\"\",D98,E99*J99),D98)","v":""},{"$f":"IFERROR(IF(K99=\"\",E98,K99*$F$3),E98)","v":0},{"$f":"IFERROR(D99*H99,F98)","v":""},{"$f":"IFERROR(IF(E99=\"\",G98,E99/$E$160),G98)","v":""},{"$f":"IFERROR(IF(L99=\"\",H98,L99/J99),H98)","v":""},{"$f":"IFERROR(J99-L99,\"\")","v":""},{"$f":"J98","v":""},"",""]
[null,null,null,null,null,null,{"$f":"(1/COUNTA(B8:B96))*0.7","v":2.3333333333333331E-2}]
["Baseline",{"$f":"'Cat 3 Setup'!A40","v":0},{"$f":"IFERROR(IF(AND(I101>$I$159,G101>$G$159),\"Star\",IF(AND(I101>$I$159,G101<$G$159),\"Puzzle\",IF(AND(I101<$I$159,G101>$G$159),\"Plow Horse\",\"Dog\"))),\"\")","v":"Dog"},{"$f":"IFERROR(VLOOKUP(B101,'Cat 3 Setup'!$A:$F,4,FALSE),\"\")","v":""},{"$f":"IFERROR(VLOOKUP(B101,'Cat 3 Setup'!$A:$F,3,FALSE),\"\")","v":0},{"$f":"IFERROR(VLOOKUP(B101,'Cat 3 Setup'!$A:$F,6,FALSE),\"\")","v":""},{"$f":"IFERROR(E101/$E$159,\"\")","v":""},{"$f":"IFERROR(F101/D101,\"\")","v":""},{"$f":"IFERROR(J101-L101,\"\")","v":""},{"$f":"IFERROR(D101/E101,\"\")","v":""},{"$f":"IFERROR(E101/$F$3,\"\")","v":""},{"$f":"IFERROR(J101*H101,\"\")","v":""}]
["Proposed",null,{"$f":"IFERROR(IF(AND(I102>$I$160,G102>$G$160),\"Star\",IF(AND(I102>$I$160,G102<$G$160),\"Puzzle\",IF(AND(I102<$I$160,G102>$G$160),\"Plow Horse\",\"Dog\"))),\"\")","v":"Dog"},{"$f":"IFERROR(IF(J102=\"\",D101,E102*J102),D101)","v":""},{"$f":"IFERROR(IF(K102=\"\",E101,K102*$F$3),E101)","v":0},{"$f":"IFERROR(D102*H102,F101)","v":""},{"$f":"IFERROR(IF(E102=\"\",G101,E102/$E$160),G101)","v":""},{"$f":"IFERROR(IF(L102=\"\",H101,L102/J102),H101)","v":""},{"$f":"IFERROR(J102-L102,\"\")","v":""},{"$f":"J101","v":""},"",""]
[]
["Baseline",{"$f":"'Cat 3 Setup'!A41","v":0},{"$f":"IFERROR(IF(AND(I104>$I$159,G104>$G$159),\"Star\",IF(AND(I104>$I$159,G104<$G$159),\"Puzzle\",IF(AND(I104<$I$159,G104>$G$159),\"Plow Horse\",\"Dog\"))),\"\")","v":"Dog"},{"$f":"IFERROR(VLOOKUP(B104,'Cat 3 Setup'!$A:$F,4,FALSE),\"\")","v":""},{"$f":"IFERROR(VLOOKUP(B104,'Cat 3 Setup'!$A:$F,3,FALSE),\"\")","v":0},{"$f":"IFERROR(VLOOKUP(B104,'Cat 3 Setup'!$A:$F,6,FALSE),\"\")","v":""},{"$f":"IFERROR(E104/$E$159,\"\")","v":""},{"$f":"IFERROR(F104/D104,\"\")","v":""},{"$f":"IFERROR(J104-L104,\"\")","v":""},{"$f":"IFERROR(D104/E104,\"\")","v":""},{"$f":"IFERROR(E104/$F$3,\"\")","v":""},{"$f":"IFERROR(J104*H104,\"\")","v":""}]
["Proposed",null,{"$f":"IFERROR(IF(AND(I105>$I$160,G105>$G$160),\"Star\",IF(AND(I105>$I$160,G105<$G$160),\"Puzzle\",IF(AND(I105<$I$160,G105>$G$160),\"Plow Horse\",\"Dog\"))),\"\")","v":"Dog"},{"$f":"IFERROR(IF(J105=\"\",D104,E105*J105),D104)","v":""},{"$f":"IFERROR(IF(K105=\"\",E104,K105*$F$3),E104)","v":0},{"$f":"IFERROR(D105*H105,F104)","v":""},{"$f":"IFERROR(IF(E105=\"\",G104,E105/$E$160),G104)","v":""},{"$f":"IFERROR(IF(L105=\"\",H104,L105/J105),H104)","v":""},{"$f":"IFERROR(J105-L105,\"\")","v":""},{"$f":"J104","v":""},"",""]
[]
["Baseline",{"$f":"'Cat 3 Setup'!A42","v":0},{"$f":"IFERROR(IF(AND(I107>$I$159,G107>$G$159),\"Star\",IF(AND(I107>$I$159,G107<$G$159),\"Puzzle\",IF(AND(I107<$I$159,G107>$G$159),\"Plow Horse\",\"Dog\"))),\"\")","v":"Dog"},{"$f":"IFERROR(VLOOKUP(B107,'Cat 3 Setup'!$A:$F,4,FALSE),\"\")","v":""},{"$f":"IFERROR(VLOOKUP(B107,'Cat 3 Setup'!$A:$F,3,FALSE),\"\")","v":0},{"$f":"IFERROR(VLOOKUP(B107,'Cat 3 Setup'!$A:$F,6,FALSE),\"\")","v":""},{"$f":"IFERROR(E107/$E$159,\"\")","v":""},{"$f":"IFERROR(F107/D107,\"\")","v":""},{"$f":"IFERROR(J107-L107,\"\")","v":""},{"$f":"IFERROR(D107/E107,\"\")","v":""},{"$f":"IFERROR(E107/$F$3,\"\")","v":""},{"$f":"IFERROR(J107*H107,\"\")","v":""}]
["Proposed",null,{"$f":"IFERROR(IF(AND(I108>$I$160,G108>$G$160),\"Star\",IF(AND(I108>$I$160,G108<$G$160),\"Puzzle\",IF(AND(I108<$I$160,G108>$G$160),\"Plow Horse\",\"Dog\"))),\"\")","v":"Dog"},{"$f":"IFERROR(IF(J108=\"\",D107,E108*J108),D107)","v":""},{"$f":"IFERROR(IF(K108=\"\",E107,K108*$F$3),E107)","v":0},{"$f":"IFERROR(D108*H108,F107)","v":""},{"$f":"IFERROR(IF(E108=\"\",G107,E108/$E$160),G107)","v":""},{"$f":"IFERROR(IF(L108=\"\",H107,L108/J108),H107)","v":""},{"$f":"IFERROR(J108-L108,\"\")","v":""},{"$f":"J107","v":""},"",""]
[]
["Baseline",{"$f":"'Cat 3 Setup'!A43","v":0},{"$f":"IFERROR(IF(AND(I110>$I$159,G110>$G$159),\"Star\",IF(AND(I110>$I$159,G110<$G$159),\"Puzzle\",IF(AND(I110<$I$159,G110>$G$159),\"Plow Horse\",\"Dog\"))),\"\")","v":"Dog"},{"$f":"IFERROR(VLOOKUP(B110,'Cat 3 Setup'!$A:$F,4,FALSE),\"\")","v":""},{"$f":"IFERROR(VLOOKUP(B110,'Cat 3 Setup'!$A:$F,3,FALSE),\"\")","v":0},{"$f":"IFERROR(VLOOKUP(B110,'Cat 3 Setup'!$A:$F,6,FALSE),\"\")","v":""},{"$f":"IFERROR(E110/$E$159,\"\")","v":""},{"$f":"IFERROR(F110/D110,\"\")","v":""},{"$f":"IFERROR(J110-L110,\"\")","v":""},{"$f":"IFERROR(D110/E110,\"\")","v":""},{"$f":"IFERROR(E110/$F$3,\"\")","v":""},{"$f":"IFERROR(J110*H110,\"\")","v":""}]
["Proposed",null,{"$f":"IFERROR(IF(AND(I111>$I$160,G111>$G$160),\"Star\",IF(AND(I111>$I$160,G111<$G$160),\"Puzzle\",IF(AND(I111<$I$160,G111>$G$160),\"Plow Horse\",\"Dog\"))),\"\")","v":"Dog"},{"$f":"IFERROR(IF(J111=\"\",D110,E111*J111),D110)","v":""},{"$f":"IFERROR(IF(K111=\"\",E110,K111*$F$3),E110)","v":0},{"$f":"IFERROR(D111*H111,F110)","v":""},{"$f":"IFERROR(IF(E111=\"\",G110,E111/$E$160),G110)","v":""},{"$f":"IFERROR(IF(L111=\"\",H110,L111/J111),H110)","v":""},{"$f":"IFERROR(J111-L111,\"\")","v":""},{"$f":"J110","v":""},"",""]
[]
["Baseline",{"$f":"'Cat 3 Setup'!A44","v":0},{"$f":"IFERROR(IF(AND(I113>$I$159,G113>$G$159),\"Star\",IF(AND(I113>$I$159,G113<$G$159),\"Puzzle\",IF(AND(I113<$I$159,G113>$G$159),\"Plow Horse\",\"Dog\"))),\"\")","v":"Dog"},{"$f":"IFERROR(VLOOKUP(B113,'Cat 3 Setup'!$A:$F,4,FALSE),\"\")","v":""},{"$f":"IFERROR(VLOOKUP(B113,'Cat 3 Setup'!$A:$F,3,FALSE),\"\")","v":0},{"$f":"IFERROR(VLOOKUP(B113,'Cat 3 Setup'!$A:$F,6,FALSE),\"\")","v":""},{"$f":"IFERROR(E113/$E$159,\"\")","v":""},{"$f":"IFERROR(F113/D113,\"\")","v":""},{"$f":"IFERROR(J113-L113,\"\")","v":""},{"$f":"IFERROR(D113/E113,\"\")","v":""},{"$f":"IFERROR(E113/$F$3,\"\")","v":""},{"$f":"IFERROR(J113*H113,\"\")","v":""}]
["Proposed",null,{"$f":"IFERROR(IF(AND(I114>$I$160,G114>$G$160),\"Star\",IF(AND(I114>$I$160,G114<$G$160),\"Puzzle\",IF(AND(I114<$I$160,G114>$G$160),\"Plow Horse\",\"Dog\"))),\"\")","v":"Dog"},{"$f":"IFERROR(IF(J114=\"\",D113,E114*J114),D113)","v":""},{"$f":"IFERROR(IF(K114=\"\",E113,K114*$F$3),E113)","v":0},{"$f":"IFERROR(D114*H114,F113)","v":""},{"$f":"IFERROR(IF(E114=\"\",G113,E114/$E$160),G113)","v":""},{"$f":"IFERROR(IF(L114=\"\",H113,L114/J114),H113)","v":""},{"$f":"IFERROR(J114-L114,\"\")","v":""},{"$f":"J113","v":""},"",""]
[]
["Baseline",{"$f":"'Cat 3 Setup'!A45","v":0},{"$f":"IFERROR(IF(AND(I116>$I$159,G116>$G$159),\"Star\",IF(AND(I116>$I$159,G116<$G$159),\"Puzzle\",IF(AND(I116<$I$159,G116>$G$159),\"Plow Horse\",\"Dog\"))),\"\")","v":"Dog"},{"$f":"IFERROR(VLOOKUP(B116,'Cat 3 Setup'!$A:$F,4,FALSE),\"\")","v":""},{"$f":"IFERROR(VLOOKUP(B116,'Cat 3 Setup'!$A:$F,3,FALSE),\"\")","v":0},{"$f":"IFERROR(VLOOKUP(B116,'Cat 3 Setup'!$A:$F,6,FALSE),\"\")","v":""},{"$f":"IFERROR(E116/$E$159,\"\")","v":""},{"$f":"IFERROR(F116/D116,\"\")","v":""},{"$f":"IFERROR(J116-L116,\"\")","v":""},{"$f":"IFERROR(D116/E116,\"\")","v":""},{"$f":"IFERROR(E116/$F$3,\"\")","v":""},{"$f":"IFERROR(J116*H116,\"\")","v":""}]
["Proposed",null,{"$f":"IFERROR(IF(AND(I117>$I$160,G117>$G$160),\"Star\",IF(AND(I117>$I$160,G117<$G$160),\"Puzzle\",IF(AND(I117<$I$160,G117>$G$160),\"Plow Horse\",\"Dog\"))),\"\")","v":"Dog"},{"$f":"IFERROR(IF(J117=\"\",D116,E117*J117),D116)","v":""},{"$f":"IFERROR(IF(K117=\"\",E116,K117*$F$3),E116)","v":0},{"$f":"IFERROR(D117*H117,F116)","v":""},{"$f":"IFERROR(IF(E117=\"\",G116,E117/$E$160),G116)","v":""},{"$f":"IFERROR(IF(L117=\"\",H116,L117/J117),H116)","v":""},{"$f":"IFERROR(J117-L117,\"\")","v":""},{"$f":"J116","v":""},"",""]
[]
["Baseline",{"$f":"'Cat 3 Setup'!A46","v":0},{"$f":"IFERROR(IF(AND(I119>$I$159,G119>$G$159),\"Star\",IF(AND(I119>$I$159,G119<$G$159),\"Puzzle\",IF(AND(I119<$I$159,G119>$G$159),\"Plow Horse\",\"Dog\"))),\"\")","v":"Dog"},{"$f":"IFERROR(VLOOKUP(B119,'Cat 3 Setup'!$A:$F,4,FALSE),\"\")","v":""},{"$f":"IFERROR(VLOOKUP(B119,'Cat 3 Setup'!$A:$F,3,FALSE),\"\")","v":0},{"$f":"IFERROR(VLOOKUP(B119,'Cat 3 Setup'!$A:$F,6,FALSE),\"\")","v":""},{"$f":"IFERROR(E119/$E$159,\"\")","v":""},{"$f":"IFERROR(F119/D119,\"\")","v":""},{"$f":"IFERROR(J119-L119,\"\")","v":""},{"$f":"IFERROR(D119/E119,\"\")","v":""},{"$f":"IFERROR(E119/$F$3,\"\")","v":""},{"$f":"IFERROR(J119*H119,\"\")","v":""}]
["Proposed",null,{"$f":"IFERROR(IF(AND(I120>$I$160,G120>$G$160),\"Star\",IF(AND(I120>$I$160,G120<$G$160),\"Puzzle\",IF(AND(I120<$I$160,G120>$G$160),\"Plow Horse\",\"Dog\"))),\"\")","v":"Dog"},{"$f":"IFERROR(IF(J120=\"\",D119,E120*J120),D119)","v":""},{"$f":"IFERROR(IF(K120=\"\",E119,K120*$F$3),E119)","v":0},{"$f":"IFERROR(D120*H120,F119)","v":""},{"$f":"IFERROR(IF(E120=\"\",G119,E120/$E$160),G119)","v":""},{"$f":"IFERROR(IF(L120=\"\",H119,L120/J120),H119)","v":""},{"$f":"IFERROR(J120-L120,\"\")","v":""},{"$f":"J119","v":""},"",""]
[]
["Baseline",{"$f":"'Cat 3 Setup'!A47","v":0},{"$f":"IFERROR(IF(AND(I122>$I$159,G122>$G$159),\"Star\",IF(AND(I122>$I$159,G122<$G$159),\"Puzzle\",IF(AND(I122<$I$159,G122>$G$159),\"Plow Horse\",\"Dog\"))),\"\")","v":"Dog"},{"$f":"IFERROR(VLOOKUP(B122,'Cat 3 Setup'!$A:$F,4,FALSE),\"\")","v":""},{"$f":"IFERROR(VLOOKUP(B122,'Cat 3 Setup'!$A:$F,3,FALSE),\"\")","v":0},{"$f":"IFERROR(VLOOKUP(B122,'Cat 3 Setup'!$A:$F,6,FALSE),\"\")","v":""},{"$f":"IFERROR(E122/$E$159,\"\")","v":""},{"$f":"IFERROR(F122/D122,\"\")","v":""},{"$f":"IFERROR(J122-L122,\"\")","v":""},{"$f":"IFERROR(D122/E122,\"\")","v":""},{"$f":"IFERROR(E122/$F$3,\"\")","v":""},{"$f":"IFERROR(J122*H122,\"\")","v":""}]
["Proposed",null,{"$f":"IFERROR(IF(AND(I123>$I$160,G123>$G$160),\"Star\",IF(AND(I123>$I$160,G123<$G$160),\"Puzzle\",IF(AND(I123<$I$160,G123>$G$160),\"Plow Horse\",\"Dog\"))),\"\")","v":"Dog"},{"$f":"IFERROR(IF(J123=\"\",D122,E123*J123),D122)","v":""},{"$f":"IFERROR(IF(K123=\"\",E122,K123*$F$3),E122)","v":0},{"$f":"IFERROR(D123*H123,F122)","v":""},{"$f":"IFERROR(IF(E123=\"\",G122,E123/$E$160),G122)","v":""},{"$f":"IFERROR(IF(L123=\"\",H122,L123/J123),H122)","v":""},"",{"$f":"J122","v":""},"",""]
[]
["Baseline",{"$f":"'Cat 3 Setup'!A48","v":0},{"$f":"IFERROR(IF(AND(I125>$I$159,G125>$G$159),\"Star\",IF(AND(I125>$I$159,G125<$G$159),\"Puzzle\",IF(AND(I125<$I$159,G125>$G$159),\"Plow Horse\",\"Dog\"))),\"\")","v":"Dog"},{"$f":"IFERROR(VLOOKUP(B125,'Cat 3 Setup'!$A:$F,4,FALSE),\"\")","v":""},{"$f":"IFERROR(VLOOKUP(B125,'Cat 3 Setup'!$A:$F,3,FALSE),\"\")","v":0},{"$f":"IFERROR(VLOOKUP(B125,'Cat 3 Setup'!$A:$F,6,FALSE),\"\")","v":""},{"$f":"IFERROR(E125/$E$159,\"\")","v":""},{"$f":"IFERROR(F125/D125,\"\")","v":""},{"$f":"IFERROR(J125-L125,\"\")","v":""},{"$f":"IFERROR(D125/E125,\"\")","v":""},{"$f":"IFERROR(E125/$F$3,\"\")","v":""},{"$f":"IFERROR(J125*H125,\"\")","v":""}]
["Proposed",null,{"$f":"IFERROR(IF(AND(I126>$I$160,G126>$G$160),\"Star\",IF(AND(I126>$I$160,G126<$G$160),\"Puzzle\",IF(AND(I126<$I$160,G126>$G$160),\"Plow Horse\",\"Dog\"))),\"\")","v":"Dog"},{"$f":"IFERROR(IF(J126=\"\",D125,E126*J126),D125)","v":""},{"$f":"IFERROR(IF(K126=\"\",E125,K126*$F$3),E125)","v":0},{"$f":"IFERROR(D126*H126,F125)","v":""},{"$f":"IFERROR(IF(E126=\"\",G125,E126/$E$160),G125)","v":""},{"$f":"IFERROR(IF(L126=\"\",H125,L126/J126),H125)","v":""},"",{"$f":"J125","v":""},"",""]
[]
["Baseline",{"$f":"'Cat 3 Setup'!A49","v":0},{"$f":"IFERROR(IF(AND(I128>$I$159,G128>$G$159),\"Star\",IF(AND(I128>$I$159,G128<$G$159),\"Puzzle\",IF(AND(I128<$I$159,G128>$G$159),\"Plow Horse\",\"Dog\"))),\"\")","v":"Dog"},{"$f":"IFERROR(VLOOKUP(B128,'Cat 3 Setup'!$A:$F,4,FALSE),\"\")","v":""},{"$f":"IFERROR(VLOOKUP(B128,'Cat 3 Setup'!$A:$F,3,FALSE),\"\")","v":0},{"$f":"IFERROR(VLOOKUP(B128,'Cat 3 Setup'!$A:$F,6,FALSE),\"\")","v":""},{"$f":"IFERROR(E128/$E$159,\"\")","v":""},{"$f":"IFERROR(F128/D128,\"\")","v":""},{"$f":"IFERROR(J128-L128,\"\")","v":""},{"$f":"IFERROR(D128/E128,\"\")","v":""},{"$f":"IFERROR(E128/$F$3,\"\")","v":""},{"$f":"IFERROR(J128*H128,\"\")","v":""}]
["Proposed",null,{"$f":"IFERROR(IF(AND(I129>$I$160,G129>$G$160),\"Star\",IF(AND(I129>$I$160,G129<$G$160),\"Puzzle\",IF(AND(I129<$I$160,G129>$G$160),\"Plow Horse\",\"Dog\"))),\"\")","v":"Dog"},{"$f":"IFERROR(IF(J129=\"\",D128,E129*J129),D128)","v":""},{"$f":"IFERROR(IF(K129=\"\",E128,K129*$F$3),E128)","v":0},{"$f":"IFERROR(D129*H129,F128)","v":""},{"$f":"IFERROR(IF(E129=\"\",G128,E129/$E$160),G128)","v":""},{"$f":"IFERROR(IF(L129=\"\",H128,L129/J129),H128)","v":""},"",{"$f":"J128","v":""},"",""]
[]
["Baseline",{"$f":"'Cat 3 Setup'!A50","v":0},{"$f":"IFERROR(IF(AND(I131>$I$159,G131>$G$159),\"Star\",IF(AND(I131>$I$159,G131<$G$159),\"Puzzle\",IF(AND(I131<$I$159,G131>$G$159),\"Plow Horse\",\"Dog\"))),\"\")","v":"Dog"},{"$f":"IFERROR(VLOOKUP(B131,'Cat 3 Setup'!$A:$F,4,FALSE),\"\")","v":""},{"$f":"IFERROR(VLOOKUP(B131,'Cat 3 Setup'!$A:$F,3,FALSE),\"\")","v":0},{"$f":"IFERROR(VLOOKUP(B131,'Cat 3 Setup'!$A:$F,6,FALSE),\"\")","v":""},{"$f":"IFERROR(E131/$E$159,\"\")","v":""},{"$f":"IFERROR(F131/D131,\"\")","v":""},{"$f":"IFERROR(J131-L131,\"\")","v":""},{"$f":"IFERROR(D131/E131,\"\")","v":""},{"$f":"IFERROR(E131/$F$3,\"\")","v":""},{"$f":"IFERROR(J131*H131,\"\")","v":""}]
["Proposed",null,{"$f":"IFERROR(IF(AND(I132>$I$160,G132>$G$160),\"Star\",IF(AND(I132>$I$160,G132<$G$160),\"Puzzle\",IF(AND(I132<$I$160,G132>$G$160),\"Plow Horse\",\"Dog\"))),\"\")","v":"Dog"},{"$f":"IFERROR(IF(J132=\"\",D131,E132*J132),D131)","v":""},{"$f":"IFERROR(IF(K132=\"\",E131,K132*$F$3),E131)","v":0},{"$f":"IFERROR(D132*H132,F131)","v":""},{"$f":"IFERROR(IF(E132=\"\",G131,E132/$E$160),G131)","v":""},{"$f":"IFERROR(IF(L132=\"\",H131,L132/J132),H131)","v":""},"",{"$f":"J131","v":""},"",""]
[]
["Baseline",{"$f":"'Cat 3 Setup'!A51","v":0},{"$f":"IFERROR(IF(AND(I134>$I$159,G134>$G$159),\"Star\",IF(AND(I134>$I$159,G134<$G$159),\"Puzzle\",IF(AND(I134<$I$159,G134>$G$159),\"Plow Horse\",\"Dog\"))),\"\")","v":"Dog"},{"$f":"IFERROR(VLOOKUP(B134,'Cat 3 Setup'!$A:$F,4,FALSE),\"\")","v":""},{"$f":"IFERROR(VLOOKUP(B134,'Cat 3 Setup'!$A:$F,3,FALSE),\"\")","v":0},{"$f":"IFERROR(VLOOKUP(B134,'Cat 3 Setup'!$A:$F,6,FALSE),\"\")","v":""},{"$f":"IFERROR(E134/$E$159,\"\")","v":""},{"$f":"IFERROR(F134/D134,\"\")","v":""},{"$f":"IFERROR(J134-L134,\"\")","v":""},{"$f":"IFERROR(D134/E134,\"\")","v":""},{"$f":"IFERROR(E134/$F$3,\"\")","v":""},{"$f":"IFERROR(J134*H134,\"\")","v":""}]
["Proposed",null,{"$f":"IFERROR(IF(AND(I135>$I$160,G135>$G$160),\"Star\",IF(AND(I135>$I$160,G135<$G$160),\"Puzzle\",IF(AND(I135<$I$160,G135>$G$160),\"Plow Horse\",\"Dog\"))),\"\")","v":"Dog"},{"$f":"IFERROR(IF(J135=\"\",D134,E135*J135),D134)","v":""},{"$f":"IFERROR(IF(K135=\"\",E134,K135*$F$3),E134)","v":0},{"$f":"IFERROR(D135*H135,F134)","v":""},{"$f":"IFERROR(IF(E135=\"\",G134,E135/$E$160),G134)","v":""},{"$f":"IFERROR(IF(L135=\"\",H134,L135/J135),H134)","v":""},"",{"$f":"J134","v":""},"",""]
[]
["Baseline",{"$f":"'Cat 3 Setup'!A52","v":0},{"$f":"IFERROR(IF(AND(I137>$I$159,G137>$G$159),\"Star\",IF(AND(I137>$I$159,G137<$G$159),\"Puzzle\",IF(AND(I137<$I$159,G137>$G$159),\"Plow Horse\",\"Dog\"))),\"\")","v":"Dog"},{"$f":"IFERROR(VLOOKUP(B137,'Cat 3 Setup'!$A:$F,4,FALSE),\"\")","v":""},{"$f":"IFERROR(VLOOKUP(B137,'Cat 3 Setup'!$A:$F,3,FALSE),\"\")","v":0},{"$f":"IFERROR(VLOOKUP(B137,'Cat 3 Setup'!$A:$F,6,FALSE),\"\")","v":""},{"$f":"IFERROR(E137/$E$159,\"\")","v":""},{"$f":"IFERROR(F137/D137,\"\")","v":""},{"$f":"IFERROR(J137-L137,\"\")","v":""},{"$f":"IFERROR(D137/E137,\"\")","v":""},{"$f":"IFERROR(E137/$F$3,\"\")","v":""},{"$f":"IFERROR(J137*H137,\"\")","v":""}]
["Proposed",null,{"$f":"IFERROR(IF(AND(I138>$I$160,G138>$G$160),\"Star\",IF(AND(I138>$I$160,G138<$G$160),\"Puzzle\",IF(AND(I138<$I$160,G138>$G$160),\"Plow Horse\",\"Dog\"))),\"\")","v":"Dog"},{"$f":"IFERROR(IF(J138=\"\",D137,E138*J138),D137)","v":""},{"$f":"IFERROR(IF(K138=\"\",E137,K138*$F$3),E137)","v":0},{"$f":"IFERROR(D138*H138,F137)","v":""},{"$f":"IFERROR(IF(E138=\"\",G137,E138/$E$160),G137)","v":""},{"$f":"IFERROR(IF(L138=\"\",H137,L138/J138),H137)","v":""},"",{"$f":"J137","v":""},"",""]
[]
["Baseline",{"$f":"'Cat 3 Setup'!A53","v":0},{"$f":"IFERROR(IF(AND(I140>$I$159,G140>$G$159),\"Star\",IF(AND(I140>$I$159,G140<$G$159),\"Puzzle\",IF(AND(I140<$I$159,G140>$G$159),\"Plow Horse\",\"Dog\"))),\"\")","v":"Dog"},{"$f":"IFERROR(VLOOKUP(B140,'Cat 3 Setup'!$A:$F,4,FALSE),\"\")","v":""},{"$f":"IFERROR(VLOOKUP(B140,'Cat 3 Setup'!$A:$F,3,FALSE),\"\")","v":0},{"$f":"IFERROR(VLOOKUP(B140,'Cat 3 Setup'!$A:$F,6,FALSE),\"\")","v":""},{"$f":"IFERROR(E140/$E$159,\"\")","v":""},{"$f":"IFERROR(F140/D140,\"\")","v":""},{"$f":"IFERROR(J140-L140,\"\")","v":""},{"$f":"IFERROR(D140/E140,\"\")","v":""},{"$f":"IFERROR(E140/$F$3,\"\")","v":""},{"$f":"IFERROR(J140*H140,\"\")","v":""}]
["Proposed",null,{"$f":"IFERROR(IF(AND(I141>$I$160,G141>$G$160),\"Star\",IF(AND(I141>$I$160,G141<$G$160),\"Puzzle\",IF(AND(I141<$I$160,G141>$G$160),\"Plow Horse\",\"Dog\"))),\"\")","v":"Dog"},{"$f":"IFERROR(IF(J141=\"\",D140,E141*J141),D140)","v":""},{"$f":"IFERROR(IF(K141=\"\",E140,K141*$F$3),E140)","v":0},{"$f":"IFERROR(D141*H141,F140)","v":""},{"$f":"IFERROR(IF(E141=\"\",G140,E141/$E$160),G140)","v":""},{"$f":"IFERROR(IF(L141=\"\",H140,L141/J141),H140)","v":""},"",{"$f":"J140","v":""},"",""]
[]
["Baseline",{"$f":"'Cat 3 Setup'!A54","v":0},{"$f":"IFERROR(IF(AND(I143>$I$159,G143>$G$159),\"Star\",IF(AND(I143>$I$159,G143<$G$159),\"Puzzle\",IF(AND(I143<$I$159,G143>$G$159),\"Plow Horse\",\"Dog\"))),\"\")","v":"Dog"},{"$f":"IFERROR(VLOOKUP(B143,'Cat 3 Setup'!$A:$F,4,FALSE),\"\")","v":""},{"$f":"IFERROR(VLOOKUP(B143,'Cat 3 Setup'!$A:$F,3,FALSE),\"\")","v":0},{"$f":"IFERROR(VLOOKUP(B143,'Cat 3 Setup'!$A:$F,6,FALSE),\"\")","v":""},{"$f":"IFERROR(E143/$E$159,\"\")","v":""},{"$f":"IFERROR(F143/D143,\"\")","v":""},{"$f":"IFERROR(J143-L143,\"\")","v":""},{"$f":"IFERROR(D143/E143,\"\")","v":""},{"$f":"IFERROR(E143/$F$3,\"\")","v":""},{"$f":"IFERROR(J143*H143,\"\")","v":""}]
["Proposed",null,{"$f":"IFERROR(IF(AND(I144>$I$160,G144>$G$160),\"Star\",IF(AND(I144>$I$160,G144<$G$160),\"Puzzle\",IF(AND(I144<$I$160,G144>$G$160),\"Plow Horse\",\"Dog\"))),\"\")","v":"Dog"},{"$f":"IFERROR(IF(J144=\"\",D143,E144*J144),D143)","v":""},{"$f":"IFERROR(IF(K144=\"\",E143,K144*$F$3),E143)","v":0},{"$f":"IFERROR(D144*H144,F143)","v":""},{"$f":"IFERROR(IF(E144=\"\",G143,E144/$E$160),G143)","v":""},{"$f":"IFERROR(IF(L144=\"\",H143,L144/J144),H143)","v":""},"",{"$f":"J143","v":""},"",""]
[]
["Baseline",{"$f":"'Cat 3 Setup'!A55","v":0},{"$f":"IFERROR(IF(AND(I146>$I$159,G146>$G$159),\"Star\",IF(AND(I146>$I$159,G146<$G$159),\"Puzzle\",IF(AND(I146<$I$159,G146>$G$159),\"Plow Horse\",\"Dog\"))),\"\")","v":"Dog"},{"$f":"IFERROR(VLOOKUP(B146,'Cat 3 Setup'!$A:$F,4,FALSE),\"\")","v":""},{"$f":"IFERROR(VLOOKUP(B146,'Cat 3 Setup'!$A:$F,3,FALSE),\"\")","v":0},{"$f":"IFERROR(VLOOKUP(B146,'Cat 3 Setup'!$A:$F,6,FALSE),\"\")","v":""},{"$f":"IFERROR(E146/$E$159,\"\")","v":""},{"$f":"IFERROR(F146/D146,\"\")","v":""},{"$f":"IFERROR(J146-L146,\"\")","v":""},{"$f":"IFERROR(D146/E146,\"\")","v":""},{"$f":"IFERROR(E146/$F$3,\"\")","v":""},{"$f":"IFERROR(J146*H146,\"\")","v":""}]
["Proposed",null,{"$f":"IFERROR(IF(AND(I147>$I$160,G147>$G$160),\"Star\",IF(AND(I147>$I$160,G147<$G$160),\"Puzzle\",IF(AND(I147<$I$160,G147>$G$160),\"Plow Horse\",\"Dog\"))),\"\")","v":"Dog"},{"$f":"IFERROR(IF(J147=\"\",D146,E147*J147),D146)","v":""},{"$f":"IFERROR(IF(K147=\"\",E146,K147*$F$3),E146)","v":0},{"$f":"IFERROR(D147*H147,F146)","v":""},{"$f":"IFERROR(IF(E147=\"\",G146,E147/$E$160),G146)","v":""},{"$f":"IFERROR(IF(L147=\"\",H146,L147/J147),H146)","v":""},"",{"$f":"J146","v":""},"",""]
[]
["Baseline",{"$f":"'Cat 3 Setup'!A56","v":0},{"$f":"IFERROR(IF(AND(I149>$I$159,G149>$G$159),\"Star\",IF(AND(I149>$I$159,G149<$G$159),\"Puzzle\",IF(AND(I149<$I$159,G149>$G$159),\"Plow Horse\",\"Dog\"))),\"\")","v":"Dog"},{"$f":"IFERROR(VLOOKUP(B149,'Cat 3 Setup'!$A:$F,4,FALSE),\"\")","v":""},{"$f":"IFERROR(VLOOKUP(B149,'Cat 3 Setup'!$A:$F,3,FALSE),\"\")","v":0},{"$f":"IFERROR(VLOOKUP(B149,'Cat 3 Setup'!$A:$F,6,FALSE),\"\")","v":""},{"$f":"IFERROR(E149/$E$159,\"\")","v":""},{"$f":"IFERROR(F149/D149,\"\")","v":""},{"$f":"IFERROR(J149-L149,\"\")","v":""},{"$f":"IFERROR(D149/E149,\"\")","v":""},{"$f":"IFERROR(E149/$F$3,\"\")","v":""},{"$f":"IFERROR(J149*H149,\"\")","v":""}]
["Proposed",null,{"$f":"IFERROR(IF(AND(I150>$I$160,G150>$G$160),\"Star\",IF(AND(I150>$I$160,G150<$G$160),\"Puzzle\",IF(AND(I150<$I$160,G150>$G$160),\"Plow Horse\",\"Dog\"))),\"\")","v":"Dog"},{"$f":"IFERROR(IF(J150=\"\",D149,E150*J150),D149)","v":""},{"$f":"IFERROR(IF(K150=\"\",E149,K150*$F$3),E149)","v":0},{"$f":"IFERROR(D150*H150,F149)","v":""},{"$f":"IFERROR(IF(E150=\"\",G149,E150/$E$160),G149)","v":""},{"$f":"IFERROR(IF(L150=\"\",H149,L150/J150),H149)","v":""},"",{"$f":"J149","v":""},"",""]
[]
["Baseline",{"$f":"'Cat 3 Setup'!A57","v":0},{"$f":"IFERROR(IF(AND(I152>$I$159,G152>$G$159),\"Star\",IF(AND(I152>$I$159,G152<$G$159),\"Puzzle\",IF(AND(I152<$I$159,G152>$G$159),\"Plow Horse\",\"Dog\"))),\"\")","v":"Dog"},{"$f":"IFERROR(VLOOKUP(B152,'Cat 3 Setup'!$A:$F,4,FALSE),\"\")","v":""},{"$f":"IFERROR(VLOOKUP(B152,'Cat 3 Setup'!$A:$F,3,FALSE),\"\")","v":0},{"$f":"IFERROR(VLOOKUP(B152,'Cat 3 Setup'!$A:$F,6,FALSE),\"\")","v":""},{"$f":"IFERROR(E152/$E$159,\"\")","v":""},{"$f":"IFERROR(F152/D152,\"\")","v":""},{"$f":"IFERROR(J152-L152,\"\")","v":""},{"$f":"IFERROR(D152/E152,\"\")","v":""},{"$f":"IFERROR(E152/$F$3,\"\")","v":""},{"$f":"IFERROR(J152*H152,\"\")","v":""}]
["Proposed",null,{"$f":"IFERROR(IF(AND(I153>$I$160,G153>$G$160),\"Star\",IF(AND(I153>$I$160,G153<$G$160),\"Puzzle\",IF(AND(I153<$I$160,G153>$G$160),\"Plow Horse\",\"Dog\"))),\"\")","v":"Dog"},{"$f":"IFERROR(IF(J153=\"\",D152,E153*J153),D152)","v":""},{"$f":"IFERROR(IF(K153=\"\",E152,K153*$F$3),E152)","v":0},{"$f":"IFERROR(D153*H153,F152)","v":""},{"$f":"IFERROR(IF(E153=\"\",G152,E153/$E$160),G152)","v":""},{"$f":"IFERROR(IF(L153=\"\",H152,L153/J153),H152)","v":""},"",{"$f":"J152","v":""},"",""]
[]
["Baseline",{"$f":"'Cat 3 Setup'!A58","v":0},{"$f":"IFERROR(IF(AND(I155>$I$159,G155>$G$159),\"Star\",IF(AND(I155>$I$159,G155<$G$159),\"Puzzle\",IF(AND(I155<$I$159,G155>$G$159),\"Plow Horse\",\"Dog\"))),\"\")","v":"Dog"},{"$f":"IFERROR(VLOOKUP(B155,'Cat 3 Setup'!$A:$F,4,FALSE),\"\")","v":""},{"$f":"IFERROR(VLOOKUP(B155,'Cat 3 Setup'!$A:$F,3,FALSE),\"\")","v":0},{"$f":"IFERROR(VLOOKUP(B155,'Cat 3 Setup'!$A:$F,6,FALSE),\"\")","v":""},{"$f":"IFERROR(E155/$E$159,\"\")","v":""},{"$f":"IFERROR(F155/D155,\"\")","v":""},{"$f":"IFERROR(J155-L155,\"\")","v":""},{"$f":"IFERROR(D155/E155,\"\")","v":""},{"$f":"IFERROR(E155/$F$3,\"\")","v":""},{"$f":"IFERROR(J155*H155,\"\")","v":""}]
["Proposed",null,{"$f":"IFERROR(IF(AND(I156>$I$160,G156>$G$160),\"Star\",IF(AND(I156>$I$160,G156<$G$160),\"Puzzle\",IF(AND(I156<$I$160,G156>$G$160),\"Plow Horse\",\"Dog\"))),\"\")","v":"Dog"},{"$f":"IFERROR(IF(J156=\"\",D155,E156*J156),D155)","v":""},{"$f":"IFERROR(IF(K156=\"\",E155,K156*$F$3),E155)","v":0},{"$f":"IFERROR(D156*H156,F155)","v":""},{"$f":"IFERROR(IF(E156=\"\",G155,E156/$E$160),G155)","v":""},{"$f":"IFERROR(IF(L156=\"\",H155,L156/J156),H155)","v":""},"",{"$f":"J155","v":""},"",""]
[]
[null,null,null,null,null,null,null,null,null,null,"(Items/Cover)"]
["Baseline","Total",null,{"$f":"IFERROR(SUMIF($A$8:$A$156,\"Baseline\",D$8:D$156),\"\")","v":0},{"$f":"IFERROR(SUMIF($A$8:$A$156,\"Baseline\",E$8:E$156),\"\")","v":0},{"$f":"IFERROR(SUMIF($A$8:$A$156,\"Baseline\",F$8:F$156),\"\")","v":0},{"$f":"IFERROR((AVERAGEIFS(G$8:G$156,$A$8:$A$156,\"Baseline\",G$8:G$156,\">0\")),\"\")","v":""},{"$f":"IFERROR(F159/D159,\"\")","v":""},{"$f":"IFERROR(AVERAGEIF($A$8:$A$156,\"Baseline\",I$8:I$156),\"\")","v":""},{"$f":"IFERROR(D159/E159,\"\")","v":""},{"$f":"IFERROR(E159/$F$3,\"\")","v":""},{"$f":"IFERROR(F159/E159,\"\")","v":""}]
["Proposed",null,null,{"$f":"IFERROR(SUMIF($A$8:$A$156,\"Proposed\",D$8:D$156),\"\")","v":0},{"$f":"IFERROR(SUMIF($A$8:$A$156,\"Proposed\",E$8:E$156),\"\")","v":0},{"$f":"IFERROR(SUMIF($A$8:$A$156,\"Proposed\",F$8:F$156),\"\")","v":0},{"$f":"IFERROR((AVERAGEIFS(G$8:G$156,$A$8:$A$156,\"Proposed\",G$8:G$156,\">0\")),\"\")","v":""},{"$f":"IFERROR(F160/D160,\"\")","v":""},{"$f":"IFERROR(AVERAGEIF($A$8:$A$156,\"Proposed\",I$8:I$156),\"\")","v":""},{"$f":"IFERROR(D160/E160,\"\")","v":""},{"$f":"IFERROR(E160/$F$3,\"\")","v":""},{"$f":"IFERROR(F160/E160,\"\")","v":""}]
[null,"%/BPs change",null,{"$f":"IFERROR((D160-D159)/D159,\"\")","v":""},{"$f":"IFERROR((E160-E159)/E159,\"\")","v":""},"",{"$f":"(G160-G159)*100","v":{"$error":"#VALUE!"}},{"$f":"(H160-H159)*100","v":{"$error":"#VALUE!"}},"","","",""]
[]
[]
[null,"Assumptions/Exclusions:"]
[]
[]
[]
[]
[]
[]
[null,"Admin Use:"]
[null,"CM (min):",{"$f":"ROUND(MIN(I8:I157),0)-5","v":-5},"Demand (max):",null,{"$f":"MIN(G8:G157)-0.05","v":-2.6666666666666672E-2}]
[null,"CM (max):",{"$f":"ROUND(MAX(I8:I157),0)+5","v":5},"Demand (min):",null,{"$f":"MAX(G8:G157)+0.05","v":7.3333333333333334E-2}]

{"sheet":"Cat 3 CM$ Chart","index":14,"n_rows":46,"n_cols":7,"rows_kept":46,"cut":false,"hidden":false,"merged":[[44,3,44,4],[45,3,45,4]]}
[{"$f":"CONCATENATE('Cat 3 CM$'!C1,\" \",'Cat 3 CM$'!C5,\" \",'Cat 3 CM$'!C4,\" - \",'Cat 3 CM$'!F5)","v":"0 0 0 - 0"}]
["Menu Enginnering Graph by Contribution Margin Dollars"]
[]
[]
[]
[]
[]
[]
[]
[]
[]
[]
[]
[]
[]
[]
[]
[]
[]
[]
[]
[]
[]
[]
[]
[]
[]
[]
[]
[]
[]
[]
[]
[]
[]
[]
[]
[]
[]
[]
[]
[]
[]
[null,null,null,null,null,"Low","High"]
[null,null,"X-AXIS -->","Menu Mix Parameters:",null,{"$f":"IFERROR(IF('Cat 3 CM$'!D8=\"\",\"\",MIN('Cat 3 CM$'!G8:G157)*0.9),\"\")","v":""},{"$f":"IFERROR(IF('Cat 3 CM$'!D8=\"\",\"\",MAX('Cat 3 CM$'!G8:G157)*1.1),\"\")","v":""}]
[null,null,"Y-AXIS -->","Contribution Margin:",null,{"$f":"IFERROR(IF('Cat 3 CM$'!D8=\"\",\"\",MIN('Cat 3 CM$'!$I$8:$I$157)*0.9),\"\")","v":""},{"$f":"IFERROR(IF('Cat 3 CM$'!D8=\"\",\"\",MAX('Cat 3 CM$'!$I$8:$I$157)*1.1),\"\")","v":""}]

{"sheet":"Cat 3 CM%","index":15,"n_rows":173,"n_cols":12,"rows_kept":173,"cut":false,"hidden":false,"merged":[[172,3,172,4],[133,1,134,1],[136,1,137,1],[139,1,140,1],[142,1,143,1],[145,1,146,1],[148,1,149,1],[151,1,152,1],[154,1,155,1],[158,1,159,2],[160,1,160,2],[171,3,171,4],[130,1,131,1],[97,1,98,1],[100,1,101,1],[103,1,104,1],[106,1,107,1],[109,1,110,1],[112,1,113,1],[115,1,116,1],[118,1,119,1],[121,1,122,1],[124,1,125,1],[127,1,128,1],[94,1,95,1],[61,1,62,1],[64,1,65,1],[67,1,68,1],[70,1,71,1],[73,1,74,1],[76,1,77,1],[79,1,80,1],[82,1,83,1],[85,1,86,1],[88,1,89,1],[91,1,92,1],[58,1,59,1],[25,1,26,1],[28,1,29,1],[31,1,32,1],[34,1,35,1],[37,1,38,1],[40,1,41,1],[43,1,44,1],[46,1,47,1],[49,1,50,1],[52,1,53,1],[55,1,56,1],[22,1,23,1],[7,1,8,1],[10,1,11,1],[13,1,14,1],[16,1,17,1],[19,1,20,1]]}
[null,"Restaurant Name",{"$f":"'Cat 3 Setup'!L1","v":0}]
[null,"Start Date:",{"$f":"'Cat 3 Setup'!L5","v":"00:00:00"},null,"Check Count:",{"$f":"'Cat 3 Setup'!N1","v":0}]
[null,"End Date",{"$f":"'Cat 3 Setup'!N5","v":"00:00:00"},null,"Cover Count:",{"$f":"'Cat 3 Setup'!N2","v":0}]
[null,"Meal Period:",{"$f":"'Cat 3 Setup'!L2","v":0},null,"Average Check:",{"$f":"'Cat 3 Setup'!N3","v":0}]
[null,"Revenue Center:",{"$f":"'Cat 3 Setup'!L3","v":0},null,"Menu Category",{"$f":"'Cat 3 Setup'!L4","v":0}]
[]
[null,"Item Name","Quadrant","Item Sales","Qty Sold","Food Cost","Menu Mix %","Item Cost %","Contribution Margin %","Item Price","Item/Cover%","Item Cost"]
["Baseline",{"$f":"'Cat 3 Setup'!A9","v":0},{"$f":"IFERROR(IF(AND(I8>$I$159,G8>$G$159),\"Star\",IF(AND(I8>$I$159,G8<$G$159),\"Puzzle\",IF(AND(I8<$I$159,G8>$G$159),\"Plow Horse\",\"Dog\"))),\"\")","v":"Dog"},{"$f":"IFERROR(VLOOKUP(B8,'Cat 3 Setup'!$A:$F,4,FALSE),\"\")","v":""},{"$f":"IFERROR(VLOOKUP(B8,'Cat 3 Setup'!$A:$F,3,FALSE),\"\")","v":0},{"$f":"IFERROR(VLOOKUP(B8,'Cat 3 Setup'!$A:$F,6,FALSE),\"\")","v":""},{"$f":"IFERROR(E8/$E$159,\"\")","v":""},{"$f":"IFERROR(F8/D8,\"\")","v":""},{"$f":"IFERROR((J8-L8)/J8,\"\")","v":""},{"$f":"IFERROR(D8/E8,\"\")","v":""},{"$f":"IFERROR(E8/$F$3,\"\")","v":""},{"$f":"IFERROR(J8*H8,\"\")","v":""}]
["Proposed",null,{"$f":"IFERROR(IF(AND(I9>$I$160,G9>$G$160),\"Star\",IF(AND(I9>$I$160,G9<$G$160),\"Puzzle\",IF(AND(I9<$I$160,G9>$G$160),\"Plow Horse\",\"Dog\"))),\"\")","v":"Dog"},{"$f":"IFERROR(IF(J9=\"\",D8,E9*J9),D8)","v":""},{"$f":"IFERROR(IF(K9=\"\",E8,K9*$F$3),E8)","v":0},{"$f":"IFERROR(D9*H9,F8)","v":""},{"$f":"IFERROR(IF(E9=\"\",G8,E9/$E$160),G8)","v":""},{"$f":"IFERROR(IF(L9=\"\",H8,L9/J9),H8)","v":""},{"$f":"IFERROR((J9-L9)/J9,\"\")","v":""},{"$f":"J8","v":""},{"$f":"K8","v":""},{"$f":"L8","v":""}]
[]
["Baseline",{"$f":"'Cat 3 Setup'!A10","v":0},{"$f":"IFERROR(IF(AND(I11>$I$159,G11>$G$159),\"Star\",IF(AND(I11>$I$159,G11<$G$159),\"Puzzle\",IF(AND(I11<$I$159,G11>$G$159),\"Plow Horse\",\"Dog\"))),\"\")","v":"Dog"},{"$f":"IFERROR(VLOOKUP(B11,'Cat 3 Setup'!$A:$F,4,FALSE),\"\")","v":""},{"$f":"IFERROR(VLOOKUP(B11,'Cat 3 Setup'!$A:$F,3,FALSE),\"\")","v":0},{"$f":"IFERROR(VLOOKUP(B11,'Cat 3 Setup'!$A:$F,6,FALSE),\"\")","v":""},{"$f":"IFERROR(E11/$E$159,\"\")","v":""},{"$f":"IFERROR(F11/D11,\"\")","v":""},{"$f":"IFERROR((J11-L11)/J11,\"\")","v":""},{"$f":"IFERROR(D11/E11,\"\")","v":""},{"$f":"IFERROR(E11/$F$3,\"\")","v":""},{"$f":"IFERROR(J11*H11,\"\")","v":""}]
["Proposed",null,{"$f":"IFERROR(IF(AND(I12>$I$160,G12>$G$160),\"Star\",IF(AND(I12>$I$160,G12<$G$160),\"Puzzle\",IF(AND(I12<$I$160,G12>$G$160),\"Plow Horse\",\"Dog\"))),\"\")","v":"Dog"},{"$f":"IFERROR(IF(J12=\"\",D11,E12*J12),D11)","v":""},{"$f":"IFERROR(IF(K12=\"\",E11,K12*$F$3),E11)","v":0},{"$f":"IFERROR(D12*H12,F11)","v":""},{"$f":"IFERROR(IF(E12=\"\",G11,E12/$E$160),G11)","v":""},{"$f":"IFERROR(IF(L12=\"\",H11,L12/J12),H11)","v":""},{"$f":"IFERROR((J12-L12)/J12,\"\")","v":""},{"$f":"J11","v":""},{"$f":"K11","v":""},{"$f":"L11","v":""}]
[]
["Baseline",{"$f":"'Cat 3 Setup'!A11","v":0},{"$f":"IFERROR(IF(AND(I14>$I$159,G14>$G$159),\"Star\",IF(AND(I14>$I$159,G14<$G$159),\"Puzzle\",IF(AND(I14<$I$159,G14>$G$159),\"Plow Horse\",\"Dog\"))),\"\")","v":"Dog"},{"$f":"IFERROR(VLOOKUP(B14,'Cat 3 Setup'!$A:$F,4,FALSE),\"\")","v":""},{"$f":"IFERROR(VLOOKUP(B14,'Cat 3 Setup'!$A:$F,3,FALSE),\"\")","v":0},{"$f":"IFERROR(VLOOKUP(B14,'Cat 3 Setup'!$A:$F,6,FALSE),\"\")","v":""},{"$f":"IFERROR(E14/$E$159,\"\")","v":""},{"$f":"IFERROR(F14/D14,\"\")","v":""},{"$f":"IFERROR((J14-L14)/J14,\"\")","v":""},{"$f":"IFERROR(D14/E14,\"\")","v":""},{"$f":"IFERROR(E14/$F$3,\"\")","v":""},{"$f":"IFERROR(J14*H14,\"\")","v":""}]
["Proposed",null,{"$f":"IFERROR(IF(AND(I15>$I$160,G15>$G$160),\"Star\",IF(AND(I15>$I$160,G15<$G$160),\"Puzzle\",IF(AND(I15<$I$160,G15>$G$160),\"Plow Horse\",\"Dog\"))),\"\")","v":"Dog"},{"$f":"IFERROR(IF(J15=\"\",D14,E15*J15),D14)","v":""},{"$f":"IFERROR(IF(K15=\"\",E14,K15*$F$3),E14)","v":0},{"$f":"IFERROR(D15*H15,F14)","v":""},{"$f":"IFERROR(IF(E15=\"\",G14,E15/$E$160),G14)","v":""},{"$f":"IFERROR(IF(L15=\"\",H14,L15/J15),H14)","v":""},{"$f":"IFERROR((J15-L15)/J15,\"\")","v":""},{"$f":"J14","v":""},{"$f":"K14","v":""},{"$f":"L14","v":""}]
[]
["Baseline",{"$f":"'Cat 3 Setup'!A12","v":0},{"$f":"IFERROR(IF(AND(I17>$I$159,G17>$G$159),\"Star\",IF(AND(I17>$I$159,G17<$G$159),\"Puzzle\",IF(AND(I17<$I$159,G17>$G$159),\"Plow Horse\",\"Dog\"))),\"\")","v":"Dog"},{"$f":"IFERROR(VLOOKUP(B17,'Cat 3 Setup'!$A:$F,4,FALSE),\"\")","v":""},{"$f":"IFERROR(VLOOKUP(B17,'Cat 3 Setup'!$A:$F,3,FALSE),\"\")","v":0},{"$f":"IFERROR(VLOOKUP(B17,'Cat 3 Setup'!$A:$F,6,FALSE),\"\")","v":""},{"$f":"IFERROR(E17/$E$159,\"\")","v":""},{"$f":"IFERROR(F17/D17,\"\")","v":""},{"$f":"IFERROR((J17-L17)/J17,\"\")","v":""},{"$f":"IFERROR(D17/E17,\"\")","v":""},{"$f":"IFERROR(E17/$F$3,\"\")","v":""},{"$f":"IFERROR(J17*H17,\"\")","v":""}]
["Proposed",null,{"$f":"IFERROR(IF(AND(I18>$I$160,G18>$G$160),\"Star\",IF(AND(I18>$I$160,G18<$G$160),\"Puzzle\",IF(AND(I18<$I$160,G18>$G$160),\"Plow Horse\",\"Dog\"))),\"\")","v":"Dog"},{"$f":"IFERROR(IF(J18=\"\",D17,E18*J18),D17)","v":""},{"$f":"IFERROR(IF(K18=\"\",E17,K18*$F$3),E17)","v":0},{"$f":"IFERROR(D18*H18,F17)","v":""},{"$f":"IFERROR(IF(E18=\"\",G17,E18/$E$160),G17)","v":""},{"$f":"IFERROR(IF(L18=\"\",H17,L18/J18),H17)","v":""},{"$f":"IFERROR((J18-L18)/J18,\"\")","v":""},{"$f":"J17","v":""},{"$f":"K17","v":""},{"$f":"L17","v":""}]
[]
["Baseline",{"$f":"'Cat 3 Setup'!A13","v":0},{"$f":"IFERROR(IF(AND(I20>$I$159,G20>$G$159),\"Star\",IF(AND(I20>$I$159,G20<$G$159),\"Puzzle\",IF(AND(I20<$I$159,G20>$G$159),\"Plow Horse\",\"Dog\"))),\"\")","v":"Dog"},{"$f":"IFERROR(VLOOKUP(B20,'Cat 3 Setup'!$A:$F,4,FALSE),\"\")","v":""},{"$f":"IFERROR(VLOOKUP(B20,'Cat 3 Setup'!$A:$F,3,FALSE),\"\")","v":0},{"$f":"IFERROR(VLOOKUP(B20,'Cat 3 Setup'!$A:$F,6,FALSE),\"\")","v":""},{"$f":"IFERROR(E20/$E$159,\"\")","v":""},{"$f":"IFERROR(F20/D20,\"\")","v":""},{"$f":"IFERROR((J20-L20)/J20,\"\")","v":""},{"$f":"IFERROR(D20/E20,\"\")","v":""},{"$f":"IFERROR(E20/$F$3,\"\")","v":""},{"$f":"IFERROR(J20*H20,\"\")","v":""}]
["Proposed",null,{"$f":"IFERROR(IF(AND(I21>$I$160,G21>$G$160),\"Star\",IF(AND(I21>$I$160,G21<$G$160),\"Puzzle\",IF(AND(I21<$I$160,G21>$G$160),\"Plow Horse\",\"Dog\"))),\"\")","v":"Dog"},{"$f":"IFERROR(IF(J21=\"\",D20,E21*J21),D20)","v":""},{"$f":"IFERROR(IF(K21=\"\",E20,K21*$F$3),E20)","v":0},{"$f":"IFERROR(D21*H21,F20)","v":""},{"$f":"IFERROR(IF(E21=\"\",G20,E21/$E$160),G20)","v":""},{"$f":"IFERROR(IF(L21=\"\",H20,L21/J21),H20)","v":""},{"$f":"IFERROR((J21-L21)/J21,\"\")","v":""},{"$f":"J20","v":""},{"$f":"K20","v":""},{"$f":"L20","v":""}]
[]
["Baseline",{"$f":"'Cat 3 Setup'!A14","v":0},{"$f":"IFERROR(IF(AND(I23>$I$159,G23>$G$159),\"Star\",IF(AND(I23>$I$159,G23<$G$159),\"Puzzle\",IF(AND(I23<$I$159,G23>$G$159),\"Plow Horse\",\"Dog\"))),\"\")","v":"Dog"},{"$f":"IFERROR(VLOOKUP(B23,'Cat 3 Setup'!$A:$F,4,FALSE),\"\")","v":""},{"$f":"IFERROR(VLOOKUP(B23,'Cat 3 Setup'!$A:$F,3,FALSE),\"\")","v":0},{"$f":"IFERROR(VLOOKUP(B23,'Cat 3 Setup'!$A:$F,6,FALSE),\"\")","v":""},{"$f":"IFERROR(E23/$E$159,\"\")","v":""},{"$f":"IFERROR(F23/D23,\"\")","v":""},{"$f":"IFERROR((J23-L23)/J23,\"\")","v":""},{"$f":"IFERROR(D23/E23,\"\")","v":""},{"$f":"IFERROR(E23/$F$3,\"\")","v":""},{"$f":"IFERROR(J23*H23,\"\")","v":""}]
["Proposed",null,{"$f":"IFERROR(IF(AND(I24>$I$160,G24>$G$160),\"Star\",IF(AND(I24>$I$160,G24<$G$160),\"Puzzle\",IF(AND(I24<$I$160,G24>$G$160),\"Plow Horse\",\"Dog\"))),\"\")","v":"Dog"},{"$f":"IFERROR(IF(J24=\"\",D23,E24*J24),D23)","v":""},{"$f":"IFERROR(IF(K24=\"\",E23,K24*$F$3),E23)","v":0},{"$f":"IFERROR(D24*H24,F23)","v":""},{"$f":"IFERROR(IF(E24=\"\",G23,E24/$E$160),G23)","v":""},{"$f":"IFERROR(IF(L24=\"\",H23,L24/J24),H23)","v":""},{"$f":"IFERROR((J24-L24)/J24,\"\")","v":""},{"$f":"J23","v":""},{"$f":"K23","v":""},{"$f":"L23","v":""}]
[]
["Baseline",{"$f":"'Cat 3 Setup'!A15","v":0},{"$f":"IFERROR(IF(AND(I26>$I$159,G26>$G$159),\"Star\",IF(AND(I26>$I$159,G26<$G$159),\"Puzzle\",IF(AND(I26<$I$159,G26>$G$159),\"Plow Horse\",\"Dog\"))),\"\")","v":"Dog"},{"$f":"IFERROR(VLOOKUP(B26,'Cat 3 Setup'!$A:$F,4,FALSE),\"\")","v":""},{"$f":"IFERROR(VLOOKUP(B26,'Cat 3 Setup'!$A:$F,3,FALSE),\"\")","v":0},{"$f":"IFERROR(VLOOKUP(B26,'Cat 3 Setup'!$A:$F,6,FALSE),\"\")","v":""},{"$f":"IFERROR(E26/$E$159,\"\")","v":""},{"$f":"IFERROR(F26/D26,\"\")","v":""},{"$f":"IFERROR((J26-L26)/J26,\"\")","v":""},{"$f":"IFERROR(D26/E26,\"\")","v":""},{"$f":"IFERROR(E26/$F$3,\"\")","v":""},{"$f":"IFERROR(J26*H26,\"\")","v":""}]
["Proposed",null,{"$f":"IFERROR(IF(AND(I27>$I$160,G27>$G$160),\"Star\",IF(AND(I27>$I$160,G27<$G$160),\"Puzzle\",IF(AND(I27<$I$160,G27>$G$160),\"Plow Horse\",\"Dog\"))),\"\")","v":"Dog"},{"$f":"IFERROR(IF(J27=\"\",D26,E27*J27),D26)","v":""},{"$f":"IFERROR(IF(K27=\"\",E26,K27*$F$3),E26)","v":0},{"$f":"IFERROR(D27*H27,F26)","v":""},{"$f":"IFERROR(IF(E27=\"\",G26,E27/$E$160),G26)","v":""},{"$f":"IFERROR(IF(L27=\"\",H26,L27/J27),H26)","v":""},{"$f":"IFERROR((J27-L27)/J27,\"\")","v":""},{"$f":"J26","v":""},{"$f":"K26","v":""},{"$f":"L26","v":""}]
[]
["Baseline",{"$f":"'Cat 3 Setup'!A16","v":0},{"$f":"IFERROR(IF(AND(I29>$I$159,G29>$G$159),\"Star\",IF(AND(I29>$I$159,G29<$G$159),\"Puzzle\",IF(AND(I29<$I$159,G29>$G$159),\"Plow Horse\",\"Dog\"))),\"\")","v":"Dog"},{"$f":"IFERROR(VLOOKUP(B29,'Cat 3 Setup'!$A:$F,4,FALSE),\"\")","v":""},{"$f":"IFERROR(VLOOKUP(B29,'Cat 3 Setup'!$A:$F,3,FALSE),\"\")","v":0},{"$f":"IFERROR(VLOOKUP(B29,'Cat 3 Setup'!$A:$F,6,FALSE),\"\")","v":""},{"$f":"IFERROR(E29/$E$159,\"\")","v":""},{"$f":"IFERROR(F29/D29,\"\")","v":""},{"$f":"IFERROR((J29-L29)/J29,\"\")","v":""},{"$f":"IFERROR(D29/E29,\"\")","v":""},{"$f":"IFERROR(E29/$F$3,\"\")","v":""},{"$f":"IFERROR(J29*H29,\"\")","v":""}]
["Proposed",null,{"$f":"IFERROR(IF(AND(I30>$I$160,G30>$G$160),\"Star\",IF(AND(I30>$I$160,G30<$G$160),\"Puzzle\",IF(AND(I30<$I$160,G30>$G$160),\"Plow Horse\",\"Dog\"))),\"\")","v":"Dog"},{"$f":"IFERROR(IF(J30=\"\",D29,E30*J30),D29)","v":""},{"$f":"IFERROR(IF(K30=\"\",E29,K30*$F$3),E29)","v":0},{"$f":"IFERROR(D30*H30,F29)","v":""},{"$f":"IFERROR(IF(E30=\"\",G29,E30/$E$160),G29)","v":""},{"$f":"IFERROR(IF(L30=\"\",H29,L30/J30),H29)","v":""},{"$f":"IFERROR((J30-L30)/J30,\"\")","v":""},{"$f":"J29","v":""},{"$f":"K29","v":""},{"$f":"L29","v":""}]
[]
["Baseline",{"$f":"'Cat 3 Setup'!A17","v":0},{"$f":"IFERROR(IF(AND(I32>$I$159,G32>$G$159),\"Star\",IF(AND(I32>$I$159,G32<$G$159),\"Puzzle\",IF(AND(I32<$I$159,G32>$G$159),\"Plow Horse\",\"Dog\"))),\"\")","v":"Dog"},{"$f":"IFERROR(VLOOKUP(B32,'Cat 3 Setup'!$A:$F,4,FALSE),\"\")","v":""},{"$f":"IFERROR(VLOOKUP(B32,'Cat 3 Setup'!$A:$F,3,FALSE),\"\")","v":0},{"$f":"IFERROR(VLOOKUP(B32,'Cat 3 Setup'!$A:$F,6,FALSE),\"\")","v":""},{"$f":"IFERROR(E32/$E$159,\"\")","v":""},{"$f":"IFERROR(F32/D32,\"\")","v":""},{"$f":"IFERROR((J32-L32)/J32,\"\")","v":""},{"$f":"IFERROR(D32/E32,\"\")","v":""},{"$f":"IFERROR(E32/$F$3,\"\")","v":""},{"$f":"IFERROR(J32*H32,\"\")","v":""}]
["Proposed",null,{"$f":"IFERROR(IF(AND(I33>$I$160,G33>$G$160),\"Star\",IF(AND(I33>$I$160,G33<$G$160),\"Puzzle\",IF(AND(I33<$I$160,G33>$G$160),\"Plow Horse\",\"Dog\"))),\"\")","v":"Dog"},{"$f":"IFERROR(IF(J33=\"\",D32,E33*J33),D32)","v":""},{"$f":"IFERROR(IF(K33=\"\",E32,K33*$F$3),E32)","v":0},{"$f":"IFERROR(D33*H33,F32)","v":""},{"$f":"IFERROR(IF(E33=\"\",G32,E33/$E$160),G32)","v":""},{"$f":"IFERROR(IF(L33=\"\",H32,L33/J33),H32)","v":""},{"$f":"IFERROR((J33-L33)/J33,\"\")","v":""},{"$f":"J32","v":""},{"$f":"K32","v":""},{"$f":"L32","v":""}]
[]
["Baseline",{"$f":"'Cat 3 Setup'!A18","v":0},{"$f":"IFERROR(IF(AND(I35>$I$159,G35>$G$159),\"Star\",IF(AND(I35>$I$159,G35<$G$159),\"Puzzle\",IF(AND(I35<$I$159,G35>$G$159),\"Plow Horse\",\"Dog\"))),\"\")","v":"Dog"},{"$f":"IFERROR(VLOOKUP(B35,'Cat 3 Setup'!$A:$F,4,FALSE),\"\")","v":""},{"$f":"IFERROR(VLOOKUP(B35,'Cat 3 Setup'!$A:$F,3,FALSE),\"\")","v":0},{"$f":"IFERROR(VLOOKUP(B35,'Cat 3 Setup'!$A:$F,6,FALSE),\"\")","v":""},{"$f":"IFERROR(E35/$E$159,\"\")","v":""},{"$f":"IFERROR(F35/D35,\"\")","v":""},{"$f":"IFERROR((J35-L35)/J35,\"\")","v":""},{"$f":"IFERROR(D35/E35,\"\")","v":""},{"$f":"IFERROR(E35/$F$3,\"\")","v":""},{"$f":"IFERROR(J35*H35,\"\")","v":""}]
["Proposed",null,{"$f":"IFERROR(IF(AND(I36>$I$160,G36>$G$160),\"Star\",IF(AND(I36>$I$160,G36<$G$160),\"Puzzle\",IF(AND(I36<$I$160,G36>$G$160),\"Plow Horse\",\"Dog\"))),\"\")","v":"Dog"},{"$f":"IFERROR(IF(J36=\"\",D35,E36*J36),D35)","v":""},{"$f":"IFERROR(IF(K36=\"\",E35,K36*$F$3),E35)","v":0},{"$f":"IFERROR(D36*H36,F35)","v":""},{"$f":"IFERROR(IF(E36=\"\",G35,E36/$E$160),G35)","v":""},{"$f":"IFERROR(IF(L36=\"\",H35,L36/J36),H35)","v":""},{"$f":"IFERROR((J36-L36)/J36,\"\")","v":""},{"$f":"J35","v":""},{"$f":"K35","v":""},{"$f":"L35","v":""}]
[]
["Baseline",{"$f":"'Cat 3 Setup'!A19","v":0},{"$f":"IFERROR(IF(AND(I38>$I$159,G38>$G$159),\"Star\",IF(AND(I38>$I$159,G38<$G$159),\"Puzzle\",IF(AND(I38<$I$159,G38>$G$159),\"Plow Horse\",\"Dog\"))),\"\")","v":"Dog"},{"$f":"IFERROR(VLOOKUP(B38,'Cat 3 Setup'!$A:$F,4,FALSE),\"\")","v":""},{"$f":"IFERROR(VLOOKUP(B38,'Cat 3 Setup'!$A:$F,3,FALSE),\"\")","v":0},{"$f":"IFERROR(VLOOKUP(B38,'Cat 3 Setup'!$A:$F,6,FALSE),\"\")","v":""},{"$f":"IFERROR(E38/$E$159,\"\")","v":""},{"$f":"IFERROR(F38/D38,\"\")","v":""},{"$f":"IFERROR((J38-L38)/J38,\"\")","v":""},{"$f":"IFERROR(D38/E38,\"\")","v":""},{"$f":"IFERROR(E38/$F$3,\"\")","v":""},{"$f":"IFERROR(J38*H38,\"\")","v":""}]
["Proposed",null,{"$f":"IFERROR(IF(AND(I39>$I$160,G39>$G$160),\"Star\",IF(AND(I39>$I$160,G39<$G$160),\"Puzzle\",IF(AND(I39<$I$160,G39>$G$160),\"Plow Horse\",\"Dog\"))),\"\")","v":"Dog"},{"$f":"IFERROR(IF(J39=\"\",D38,E39*J39),D38)","v":""},{"$f":"IFERROR(IF(K39=\"\",E38,K39*$F$3),E38)","v":0},{"$f":"IFERROR(D39*H39,F38)","v":""},{"$f":"IFERROR(IF(E39=\"\",G38,E39/$E$160),G38)","v":""},{"$f":"IFERROR(IF(L39=\"\",H38,L39/J39),H38)","v":""},{"$f":"IFERROR((J39-L39)/J39,\"\")","v":""},{"$f":"J38","v":""},{"$f":"K38","v":""},{"$f":"L38","v":""}]
[]
["Baseline",{"$f":"'Cat 3 Setup'!A20","v":0},{"$f":"IFERROR(IF(AND(I41>$I$159,G41>$G$159),\"Star\",IF(AND(I41>$I$159,G41<$G$159),\"Puzzle\",IF(AND(I41<$I$159,G41>$G$159),\"Plow Horse\",\"Dog\"))),\"\")","v":"Dog"},{"$f":"IFERROR(VLOOKUP(B41,'Cat 3 Setup'!$A:$F,4,FALSE),\"\")","v":""},{"$f":"IFERROR(VLOOKUP(B41,'Cat 3 Setup'!$A:$F,3,FALSE),\"\")","v":0},{"$f":"IFERROR(VLOOKUP(B41,'Cat 3 Setup'!$A:$F,6,FALSE),\"\")","v":""},{"$f":"IFERROR(E41/$E$159,\"\")","v":""},{"$f":"IFERROR(F41/D41,\"\")","v":""},{"$f":"IFERROR((J41-L41)/J41,\"\")","v":""},{"$f":"IFERROR(D41/E41,\"\")","v":""},{"$f":"IFERROR(E41/$F$3,\"\")","v":""},{"$f":"IFERROR(J41*H41,\"\")","v":""}]
["Proposed",null,{"$f":"IFERROR(IF(AND(I42>$I$160,G42>$G$160),\"Star\",IF(AND(I42>$I$160,G42<$G$160),\"Puzzle\",IF(AND(I42<$I$160,G42>$G$160),\"Plow Horse\",\"Dog\"))),\"\")","v":"Dog"},{"$f":"IFERROR(IF(J42=\"\",D41,E42*J42),D41)","v":""},{"$f":"IFERROR(IF(K42=\"\",E41,K42*$F$3),E41)","v":0},{"$f":"IFERROR(D42*H42,F41)","v":""},{"$f":"IFERROR(IF(E42=\"\",G41,E42/$E$160),G41)","v":""},{"$f":"IFERROR(IF(L42=\"\",H41,L42/J42),H41)","v":""},{"$f":"IFERROR((J42-L42)/J42,\"\")","v":""},{"$f":"J41","v":""},{"$f":"K41","v":""},{"$f":"L41","v":""}]
[]
["Baseline",{"$f":"'Cat 3 Setup'!A21","v":0},{"$f":"IFERROR(IF(AND(I44>$I$159,G44>$G$159),\"Star\",IF(AND(I44>$I$159,G44<$G$159),\"Puzzle\",IF(AND(I44<$I$159,G44>$G$159),\"Plow Horse\",\"Dog\"))),\"\")","v":"Dog"},{"$f":"IFERROR(VLOOKUP(B44,'Cat 3 Setup'!$A:$F,4,FALSE),\"\")","v":""},{"$f":"IFERROR(VLOOKUP(B44,'Cat 3 Setup'!$A:$F,3,FALSE),\"\")","v":0},{"$f":"IFERROR(VLOOKUP(B44,'Cat 3 Setup'!$A:$F,6,FALSE),\"\")","v":""},{"$f":"IFERROR(E44/$E$159,\"\")","v":""},{"$f":"IFERROR(F44/D44,\"\")","v":""},{"$f":"IFERROR((J44-L44)/J44,\"\")","v":""},{"$f":"IFERROR(D44/E44,\"\")","v":""},{"$f":"IFERROR(E44/$F$3,\"\")","v":""},{"$f":"IFERROR(J44*H44,\"\")","v":""}]
["Proposed",null,{"$f":"IFERROR(IF(AND(I45>$I$160,G45>$G$160),\"Star\",IF(AND(I45>$I$160,G45<$G$160),\"Puzzle\",IF(AND(I45<$I$160,G45>$G$160),\"Plow Horse\",\"Dog\"))),\"\")","v":"Dog"},{"$f":"IFERROR(IF(J45=\"\",D44,E45*J45),D44)","v":""},{"$f":"IFERROR(IF(K45=\"\",E44,K45*$F$3),E44)","v":0},{"$f":"IFERROR(D45*H45,F44)","v":""},{"$f":"IFERROR(IF(E45=\"\",G44,E45/$E$160),G44)","v":""},{"$f":"IFERROR(IF(L45=\"\",H44,L45/J45),H44)","v":""},{"$f":"IFERROR((J45-L45)/J45,\"\")","v":""},{"$f":"J44","v":""},{"$f":"K44","v":""},{"$f":"L44","v":""}]
[]
["Baseline",{"$f":"'Cat 3 Setup'!A22","v":0},{"$f":"IFERROR(IF(AND(I47>$I$159,G47>$G$159),\"Star\",IF(AND(I47>$I$159,G47<$G$159),\"Puzzle\",IF(AND(I47<$I$159,G47>$G$159),\"Plow Horse\",\"Dog\"))),\"\")","v":"Dog"},{"$f":"IFERROR(VLOOKUP(B47,'Cat 3 Setup'!$A:$F,4,FALSE),\"\")","v":""},{"$f":"IFERROR(VLOOKUP(B47,'Cat 3 Setup'!$A:$F,3,FALSE),\"\")","v":0},{"$f":"IFERROR(VLOOKUP(B47,'Cat 3 Setup'!$A:$F,6,FALSE),\"\")","v":""},{"$f":"IFERROR(E47/$E$159,\"\")","v":""},{"$f":"IFERROR(F47/D47,\"\")","v":""},{"$f":"IFERROR((J47-L47)/J47,\"\")","v":""},{"$f":"IFERROR(D47/E47,\"\")","v":""},{"$f":"IFERROR(E47/$F$3,\"\")","v":""},{"$f":"IFERROR(J47*H47,\"\")","v":""}]
["Proposed",null,{"$f":"IFERROR(IF(AND(I48>$I$160,G48>$G$160),\"Star\",IF(AND(I48>$I$160,G48<$G$160),\"Puzzle\",IF(AND(I48<$I$160,G48>$G$160),\"Plow Horse\",\"Dog\"))),\"\")","v":"Dog"},{"$f":"IFERROR(IF(J48=\"\",D47,E48*J48),D47)","v":""},{"$f":"IFERROR(IF(K48=\"\",E47,K48*$F$3),E47)","v":0},{"$f":"IFERROR(D48*H48,F47)","v":""},{"$f":"IFERROR(IF(E48=\"\",G47,E48/$E$160),G47)","v":""},{"$f":"IFERROR(IF(L48=\"\",H47,L48/J48),H47)","v":""},{"$f":"IFERROR((J48-L48)/J48,\"\")","v":""},{"$f":"J47","v":""},{"$f":"K47","v":""},{"$f":"L47","v":""}]
[]
["Baseline",{"$f":"'Cat 3 Setup'!A23","v":0},{"$f":"IFERROR(IF(AND(I50>$I$159,G50>$G$159),\"Star\",IF(AND(I50>$I$159,G50<$G$159),\"Puzzle\",IF(AND(I50<$I$159,G50>$G$159),\"Plow Horse\",\"Dog\"))),\"\")","v":"Dog"},{"$f":"IFERROR(VLOOKUP(B50,'Cat 3 Setup'!$A:$F,4,FALSE),\"\")","v":""},{"$f":"IFERROR(VLOOKUP(B50,'Cat 3 Setup'!$A:$F,3,FALSE),\"\")","v":0},{"$f":"IFERROR(VLOOKUP(B50,'Cat 3 Setup'!$A:$F,6,FALSE),\"\")","v":""},{"$f":"IFERROR(E50/$E$159,\"\")","v":""},{"$f":"IFERROR(F50/D50,\"\")","v":""},{"$f":"IFERROR((J50-L50)/J50,\"\")","v":""},{"$f":"IFERROR(D50/E50,\"\")","v":""},{"$f":"IFERROR(E50/$F$3,\"\")","v":""},{"$f":"IFERROR(J50*H50,\"\")","v":""}]
["Proposed",null,{"$f":"IFERROR(IF(AND(I51>$I$160,G51>$G$160),\"Star\",IF(AND(I51>$I$160,G51<$G$160),\"Puzzle\",IF(AND(I51<$I$160,G51>$G$160),\"Plow Horse\",\"Dog\"))),\"\")","v":"Dog"},{"$f":"IFERROR(IF(J51=\"\",D50,E51*J51),D50)","v":""},{"$f":"IFERROR(IF(K51=\"\",E50,K51*$F$3),E50)","v":0},{"$f":"IFERROR(D51*H51,F50)","v":""},{"$f":"IFERROR(IF(E51=\"\",G50,E51/$E$160),G50)","v":""},{"$f":"IFERROR(IF(L51=\"\",H50,L51/J51),H50)","v":""},{"$f":"IFERROR((J51-L51)/J51,\"\")","v":""},{"$f":"J50","v":""},{"$f":"K50","v":""},{"$f":"L50","v":""}]
[]
["Baseline",{"$f":"'Cat 3 Setup'!A24","v":0},{"$f":"IFERROR(IF(AND(I53>$I$159,G53>$G$159),\"Star\",IF(AND(I53>$I$159,G53<$G$159),\"Puzzle\",IF(AND(I53<$I$159,G53>$G$159),\"Plow Horse\",\"Dog\"))),\"\")","v":"Dog"},{"$f":"IFERROR(VLOOKUP(B53,'Cat 3 Setup'!$A:$F,4,FALSE),\"\")","v":""},{"$f":"IFERROR(VLOOKUP(B53,'Cat 3 Setup'!$A:$F,3,FALSE),\"\")","v":0},{"$f":"IFERROR(VLOOKUP(B53,'Cat 3 Setup'!$A:$F,6,FALSE),\"\")","v":""},{"$f":"IFERROR(E53/$E$159,\"\")","v":""},{"$f":"IFERROR(F53/D53,\"\")","v":""},{"$f":"IFERROR((J53-L53)/J53,\"\")","v":""},{"$f":"IFERROR(D53/E53,\"\")","v":""},{"$f":"IFERROR(E53/$F$3,\"\")","v":""},{"$f":"IFERROR(J53*H53,\"\")","v":""}]
["Proposed",null,{"$f":"IFERROR(IF(AND(I54>$I$160,G54>$G$160),\"Star\",IF(AND(I54>$I$160,G54<$G$160),\"Puzzle\",IF(AND(I54<$I$160,G54>$G$160),\"Plow Horse\",\"Dog\"))),\"\")","v":"Dog"},{"$f":"IFERROR(IF(J54=\"\",D53,E54*J54),D53)","v":""},{"$f":"IFERROR(IF(K54=\"\",E53,K54*$F$3),E53)","v":0},{"$f":"IFERROR(D54*H54,F53)","v":""},{"$f":"IFERROR(IF(E54=\"\",G53,E54/$E$160),G53)","v":""},{"$f":"IFERROR(IF(L54=\"\",H53,L54/J54),H53)","v":""},{"$f":"IFERROR((J54-L54)/J54,\"\")","v":""},{"$f":"J53","v":""},{"$f":"K53","v":""},{"$f":"L53","v":""}]
[]
["Baseline",{"$f":"'Cat 3 Setup'!A25","v":0},{"$f":"IFERROR(IF(AND(I56>$I$159,G56>$G$159),\"Star\",IF(AND(I56>$I$159,G56<$G$159),\"Puzzle\",IF(AND(I56<$I$159,G56>$G$159),\"Plow Horse\",\"Dog\"))),\"\")","v":"Dog"},{"$f":"IFERROR(VLOOKUP(B56,'Cat 3 Setup'!$A:$F,4,FALSE),\"\")","v":""},{"$f":"IFERROR(VLOOKUP(B56,'Cat 3 Setup'!$A:$F,3,FALSE),\"\")","v":0},{"$f":"IFERROR(VLOOKUP(B56,'Cat 3 Setup'!$A:$F,6,FALSE),\"\")","v":""},{"$f":"IFERROR(E56/$E$159,\"\")","v":""},{"$f":"IFERROR(F56/D56,\"\")","v":""},{"$f":"IFERROR((J56-L56)/J56,\"\")","v":""},{"$f":"IFERROR(D56/E56,\"\")","v":""},{"$f":"IFERROR(E56/$F$3,\"\")","v":""},{"$f":"IFERROR(J56*H56,\"\")","v":""}]
["Proposed",null,{"$f":"IFERROR(IF(AND(I57>$I$160,G57>$G$160),\"Star\",IF(AND(I57>$I$160,G57<$G$160),\"Puzzle\",IF(AND(I57<$I$160,G57>$G$160),\"Plow Horse\",\"Dog\"))),\"\")","v":"Dog"},{"$f":"IFERROR(IF(J57=\"\",D56,E57*J57),D56)","v":""},{"$f":"IFERROR(IF(K57=\"\",E56,K57*$F$3),E56)","v":0},{"$f":"IFERROR(D57*H57,F56)","v":""},{"$f":"IFERROR(IF(E57=\"\",G56,E57/$E$160),G56)","v":""},{"$f":"IFERROR(IF(L57=\"\",H56,L57/J57),H56)","v":""},{"$f":"IFERROR((J57-L57)/J57,\"\")","v":""},{"$f":"J56","v":""},{"$f":"K56","v":""},{"$f":"L56","v":""}]
[]
["Baseline",{"$f":"'Cat 3 Setup'!A26","v":0},{"$f":"IFERROR(IF(AND(I59>$I$159,G59>$G$159),\"Star\",IF(AND(I59>$I$159,G59<$G$159),\"Puzzle\",IF(AND(I59<$I$159,G59>$G$159),\"Plow Horse\",\"Dog\"))),\"\")","v":"Dog"},{"$f":"IFERROR(VLOOKUP(B59,'Cat 3 Setup'!$A:$F,4,FALSE),\"\")","v":""},{"$f":"IFERROR(VLOOKUP(B59,'Cat 3 Setup'!$A:$F,3,FALSE),\"\")","v":0},{"$f":"IFERROR(VLOOKUP(B59,'Cat 3 Setup'!$A:$F,6,FALSE),\"\")","v":""},{"$f":"IFERROR(E59/$E$159,\"\")","v":""},{"$f":"IFERROR(F59/D59,\"\")","v":""},{"$f":"IFERROR((J59-L59)/J59,\"\")","v":""},{"$f":"IFERROR(D59/E59,\"\")","v":""},{"$f":"IFERROR(E59/$F$3,\"\")","v":""},{"$f":"IFERROR(J59*H59,\"\")","v":""}]
["Proposed",null,{"$f":"IFERROR(IF(AND(I60>$I$160,G60>$G$160),\"Star\",IF(AND(I60>$I$160,G60<$G$160),\"Puzzle\",IF(AND(I60<$I$160,G60>$G$160),\"Plow Horse\",\"Dog\"))),\"\")","v":"Dog"},{"$f":"IFERROR(IF(J60=\"\",D59,E60*J60),D59)","v":""},{"$f":"IFERROR(IF(K60=\"\",E59,K60*$F$3),E59)","v":0},{"$f":"IFERROR(D60*H60,F59)","v":""},{"$f":"IFERROR(IF(E60=\"\",G59,E60/$E$160),G59)","v":""},{"$f":"IFERROR(IF(L60=\"\",H59,L60/J60),H59)","v":""},{"$f":"IFERROR((J60-L60)/J60,\"\")","v":""},{"$f":"J59","v":""},{"$f":"K59","v":""},{"$f":"L59","v":""}]
[]
["Baseline",{"$f":"'Cat 3 Setup'!A27","v":0},{"$f":"IFERROR(IF(AND(I62>$I$159,G62>$G$159),\"Star\",IF(AND(I62>$I$159,G62<$G$159),\"Puzzle\",IF(AND(I62<$I$159,G62>$G$159),\"Plow Horse\",\"Dog\"))),\"\")","v":"Dog"},{"$f":"IFERROR(VLOOKUP(B62,'Cat 3 Setup'!$A:$F,4,FALSE),\"\")","v":""},{"$f":"IFERROR(VLOOKUP(B62,'Cat 3 Setup'!$A:$F,3,FALSE),\"\")","v":0},{"$f":"IFERROR(VLOOKUP(B62,'Cat 3 Setup'!$A:$F,6,FALSE),\"\")","v":""},{"$f":"IFERROR(E62/$E$159,\"\")","v":""},{"$f":"IFERROR(F62/D62,\"\")","v":""},{"$f":"IFERROR((J62-L62)/J62,\"\")","v":""},{"$f":"IFERROR(D62/E62,\"\")","v":""},{"$f":"IFERROR(E62/$F$3,\"\")","v":""},{"$f":"IFERROR(J62*H62,\"\")","v":""}]
["Proposed",null,{"$f":"IFERROR(IF(AND(I63>$I$160,G63>$G$160),\"Star\",IF(AND(I63>$I$160,G63<$G$160),\"Puzzle\",IF(AND(I63<$I$160,G63>$G$160),\"Plow Horse\",\"Dog\"))),\"\")","v":"Dog"},{"$f":"IFERROR(IF(J63=\"\",D62,E63*J63),D62)","v":""},{"$f":"IFERROR(IF(K63=\"\",E62,K63*$F$3),E62)","v":0},{"$f":"IFERROR(D63*H63,F62)","v":""},{"$f":"IFERROR(IF(E63=\"\",G62,E63/$E$160),G62)","v":""},{"$f":"IFERROR(IF(L63=\"\",H62,L63/J63),H62)","v":""},{"$f":"IFERROR((J63-L63)/J63,\"\")","v":""},{"$f":"J62","v":""},{"$f":"K62","v":""},{"$f":"L62","v":""}]
[]
["Baseline",{"$f":"'Cat 3 Setup'!A28","v":0},{"$f":"IFERROR(IF(AND(I65>$I$159,G65>$G$159),\"Star\",IF(AND(I65>$I$159,G65<$G$159),\"Puzzle\",IF(AND(I65<$I$159,G65>$G$159),\"Plow Horse\",\"Dog\"))),\"\")","v":"Dog"},{"$f":"IFERROR(VLOOKUP(B65,'Cat 3 Setup'!$A:$F,4,FALSE),\"\")","v":""},{"$f":"IFERROR(VLOOKUP(B65,'Cat 3 Setup'!$A:$F,3,FALSE),\"\")","v":0},{"$f":"IFERROR(VLOOKUP(B65,'Cat 3 Setup'!$A:$F,6,FALSE),\"\")","v":""},{"$f":"IFERROR(E65/$E$159,\"\")","v":""},{"$f":"IFERROR(F65/D65,\"\")","v":""},{"$f":"IFERROR((J65-L65)/J65,\"\")","v":""},{"$f":"IFERROR(D65/E65,\"\")","v":""},{"$f":"IFERROR(E65/$F$3,\"\")","v":""},{"$f":"IFERROR(J65*H65,\"\")","v":""}]
["Proposed",null,{"$f":"IFERROR(IF(AND(I66>$I$160,G66>$G$160),\"Star\",IF(AND(I66>$I$160,G66<$G$160),\"Puzzle\",IF(AND(I66<$I$160,G66>$G$160),\"Plow Horse\",\"Dog\"))),\"\")","v":"Dog"},{"$f":"IFERROR(IF(J66=\"\",D65,E66*J66),D65)","v":""},{"$f":"IFERROR(IF(K66=\"\",E65,K66*$F$3),E65)","v":0},{"$f":"IFERROR(D66*H66,F65)","v":""},{"$f":"IFERROR(IF(E66=\"\",G65,E66/$E$160),G65)","v":""},{"$f":"IFERROR(IF(L66=\"\",H65,L66/J66),H65)","v":""},{"$f":"IFERROR((J66-L66)/J66,\"\")","v":""},{"$f":"J65","v":""},{"$f":"K65","v":""},{"$f":"L65","v":""}]
[]
["Baseline",{"$f":"'Cat 3 Setup'!A29","v":0},{"$f":"IFERROR(IF(AND(I68>$I$159,G68>$G$159),\"Star\",IF(AND(I68>$I$159,G68<$G$159),\"Puzzle\",IF(AND(I68<$I$159,G68>$G$159),\"Plow Horse\",\"Dog\"))),\"\")","v":"Dog"},{"$f":"IFERROR(VLOOKUP(B68,'Cat 3 Setup'!$A:$F,4,FALSE),\"\")","v":""},{"$f":"IFERROR(VLOOKUP(B68,'Cat 3 Setup'!$A:$F,3,FALSE),\"\")","v":0},{"$f":"IFERROR(VLOOKUP(B68,'Cat 3 Setup'!$A:$F,6,FALSE),\"\")","v":""},{"$f":"IFERROR(E68/$E$159,\"\")","v":""},{"$f":"IFERROR(F68/D68,\"\")","v":""},{"$f":"IFERROR((J68-L68)/J68,\"\")","v":""},{"$f":"IFERROR(D68/E68,\"\")","v":""},{"$f":"IFERROR(E68/$F$3,\"\")","v":""},{"$f":"IFERROR(J68*H68,\"\")","v":""}]
["Proposed",null,{"$f":"IFERROR(IF(AND(I69>$I$160,G69>$G$160),\"Star\",IF(AND(I69>$I$160,G69<$G$160),\"Puzzle\",IF(AND(I69<$I$160,G69>$G$160),\"Plow Horse\",\"Dog\"))),\"\")","v":"Dog"},{"$f":"IFERROR(IF(J69=\"\",D68,E69*J69),D68)","v":""},{"$f":"IFERROR(IF(K69=\"\",E68,K69*$F$3),E68)","v":0},{"$f":"IFERROR(D69*H69,F68)","v":""},{"$f":"IFERROR(IF(E69=\"\",G68,E69/$E$160),G68)","v":""},{"$f":"IFERROR(IF(L69=\"\",H68,L69/J69),H68)","v":""},{"$f":"IFERROR((J69-L69)/J69,\"\")","v":""},{"$f":"J68","v":""},{"$f":"K68","v":""},{"$f":"L68","v":""}]
[]
["Baseline",{"$f":"'Cat 3 Setup'!A30","v":0},{"$f":"IFERROR(IF(AND(I71>$I$159,G71>$G$159),\"Star\",IF(AND(I71>$I$159,G71<$G$159),\"Puzzle\",IF(AND(I71<$I$159,G71>$G$159),\"Plow Horse\",\"Dog\"))),\"\")","v":"Dog"},{"$f":"IFERROR(VLOOKUP(B71,'Cat 3 Setup'!$A:$F,4,FALSE),\"\")","v":""},{"$f":"IFERROR(VLOOKUP(B71,'Cat 3 Setup'!$A:$F,3,FALSE),\"\")","v":0},{"$f":"IFERROR(VLOOKUP(B71,'Cat 3 Setup'!$A:$F,6,FALSE),\"\")","v":""},{"$f":"IFERROR(E71/$E$159,\"\")","v":""},{"$f":"IFERROR(F71/D71,\"\")","v":""},{"$f":"IFERROR((J71-L71)/J71,\"\")","v":""},{"$f":"IFERROR(D71/E71,\"\")","v":""},{"$f":"IFERROR(E71/$F$3,\"\")","v":""},{"$f":"IFERROR(J71*H71,\"\")","v":""}]
["Proposed",null,{"$f":"IFERROR(IF(AND(I72>$I$160,G72>$G$160),\"Star\",IF(AND(I72>$I$160,G72<$G$160),\"Puzzle\",IF(AND(I72<$I$160,G72>$G$160),\"Plow Horse\",\"Dog\"))),\"\")","v":"Dog"},{"$f":"IFERROR(IF(J72=\"\",D71,E72*J72),D71)","v":""},{"$f":"IFERROR(IF(K72=\"\",E71,K72*$F$3),E71)","v":0},{"$f":"IFERROR(D72*H72,F71)","v":""},{"$f":"IFERROR(IF(E72=\"\",G71,E72/$E$160),G71)","v":""},{"$f":"IFERROR(IF(L72=\"\",H71,L72/J72),H71)","v":""},{"$f":"IFERROR((J72-L72)/J72,\"\")","v":""},{"$f":"J71","v":""},{"$f":"K71","v":""},{"$f":"L71","v":""}]
[]
["Baseline",{"$f":"'Cat 3 Setup'!A31","v":0},{"$f":"IFERROR(IF(AND(I74>$I$159,G74>$G$159),\"Star\",IF(AND(I74>$I$159,G74<$G$159),\"Puzzle\",IF(AND(I74<$I$159,G74>$G$159),\"Plow Horse\",\"Dog\"))),\"\")","v":"Dog"},{"$f":"IFERROR(VLOOKUP(B74,'Cat 3 Setup'!$A:$F,4,FALSE),\"\")","v":""},{"$f":"IFERROR(VLOOKUP(B74,'Cat 3 Setup'!$A:$F,3,FALSE),\"\")","v":0},{"$f":"IFERROR(VLOOKUP(B74,'Cat 3 Setup'!$A:$F,6,FALSE),\"\")","v":""},{"$f":"IFERROR(E74/$E$159,\"\")","v":""},{"$f":"IFERROR(F74/D74,\"\")","v":""},{"$f":"IFERROR((J74-L74)/J74,\"\")","v":""},{"$f":"IFERROR(D74/E74,\"\")","v":""},{"$f":"IFERROR(E74/$F$3,\"\")","v":""},{"$f":"IFERROR(J74*H74,\"\")","v":""}]
["Proposed",null,{"$f":"IFERROR(IF(AND(I75>$I$160,G75>$G$160),\"Star\",IF(AND(I75>$I$160,G75<$G$160),\"Puzzle\",IF(AND(I75<$I$160,G75>$G$160),\"Plow Horse\",\"Dog\"))),\"\")","v":"Dog"},{"$f":"IFERROR(IF(J75=\"\",D74,E75*J75),D74)","v":""},{"$f":"IFERROR(IF(K75=\"\",E74,K75*$F$3),E74)","v":0},{"$f":"IFERROR(D75*H75,F74)","v":""},{"$f":"IFERROR(IF(E75=\"\",G74,E75/$E$160),G74)","v":""},{"$f":"IFERROR(IF(L75=\"\",H74,L75/J75),H74)","v":""},{"$f":"IFERROR((J75-L75)/J75,\"\")","v":""},{"$f":"J74","v":""},{"$f":"K74","v":""},{"$f":"L74","v":""}]
[]
["Baseline",{"$f":"'Cat 3 Setup'!A32","v":0},{"$f":"IFERROR(IF(AND(I77>$I$159,G77>$G$159),\"Star\",IF(AND(I77>$I$159,G77<$G$159),\"Puzzle\",IF(AND(I77<$I$159,G77>$G$159),\"Plow Horse\",\"Dog\"))),\"\")","v":"Dog"},{"$f":"IFERROR(VLOOKUP(B77,'Cat 3 Setup'!$A:$F,4,FALSE),\"\")","v":""},{"$f":"IFERROR(VLOOKUP(B77,'Cat 3 Setup'!$A:$F,3,FALSE),\"\")","v":0},{"$f":"IFERROR(VLOOKUP(B77,'Cat 3 Setup'!$A:$F,6,FALSE),\"\")","v":""},{"$f":"IFERROR(E77/$E$159,\"\")","v":""},{"$f":"IFERROR(F77/D77,\"\")","v":""},{"$f":"IFERROR((J77-L77)/J77,\"\")","v":""},{"$f":"IFERROR(D77/E77,\"\")","v":""},{"$f":"IFERROR(E77/$F$3,\"\")","v":""},{"$f":"IFERROR(J77*H77,\"\")","v":""}]
["Proposed",null,{"$f":"IFERROR(IF(AND(I78>$I$160,G78>$G$160),\"Star\",IF(AND(I78>$I$160,G78<$G$160),\"Puzzle\",IF(AND(I78<$I$160,G78>$G$160),\"Plow Horse\",\"Dog\"))),\"\")","v":"Dog"},{"$f":"IFERROR(IF(J78=\"\",D77,E78*J78),D77)","v":""},{"$f":"IFERROR(IF(K78=\"\",E77,K78*$F$3),E77)","v":0},{"$f":"IFERROR(D78*H78,F77)","v":""},{"$f":"IFERROR(IF(E78=\"\",G77,E78/$E$160),G77)","v":""},{"$f":"IFERROR(IF(L78=\"\",H77,L78/J78),H77)","v":""},{"$f":"IFERROR((J78-L78)/J78,\"\")","v":""},{"$f":"J77","v":""},{"$f":"K77","v":""},{"$f":"L77","v":""}]
[]
["Baseline",{"$f":"'Cat 3 Setup'!A33","v":0},{"$f":"IFERROR(IF(AND(I80>$I$159,G80>$G$159),\"Star\",IF(AND(I80>$I$159,G80<$G$159),\"Puzzle\",IF(AND(I80<$I$159,G80>$G$159),\"Plow Horse\",\"Dog\"))),\"\")","v":"Dog"},{"$f":"IFERROR(VLOOKUP(B80,'Cat 3 Setup'!$A:$F,4,FALSE),\"\")","v":""},{"$f":"IFERROR(VLOOKUP(B80,'Cat 3 Setup'!$A:$F,3,FALSE),\"\")","v":0},{"$f":"IFERROR(VLOOKUP(B80,'Cat 3 Setup'!$A:$F,6,FALSE),\"\")","v":""},{"$f":"IFERROR(E80/$E$159,\"\")","v":""},{"$f":"IFERROR(F80/D80,\"\")","v":""},{"$f":"IFERROR((J80-L80)/J80,\"\")","v":""},{"$f":"IFERROR(D80/E80,\"\")","v":""},{"$f":"IFERROR(E80/$F$3,\"\")","v":""},{"$f":"IFERROR(J80*H80,\"\")","v":""}]
["Proposed",null,{"$f":"IFERROR(IF(AND(I81>$I$160,G81>$G$160),\"Star\",IF(AND(I81>$I$160,G81<$G$160),\"Puzzle\",IF(AND(I81<$I$160,G81>$G$160),\"Plow Horse\",\"Dog\"))),\"\")","v":"Dog"},{"$f":"IFERROR(IF(J81=\"\",D80,E81*J81),D80)","v":""},{"$f":"IFERROR(IF(K81=\"\",E80,K81*$F$3),E80)","v":0},{"$f":"IFERROR(D81*H81,F80)","v":""},{"$f":"IFERROR(IF(E81=\"\",G80,E81/$E$160),G80)","v":""},{"$f":"IFERROR(IF(L81=\"\",H80,L81/J81),H80)","v":""},{"$f":"IFERROR((J81-L81)/J81,\"\")","v":""},{"$f":"J80","v":""},{"$f":"K80","v":""},{"$f":"L80","v":""}]
[]
["Baseline",{"$f":"'Cat 3 Setup'!A34","v":0},{"$f":"IFERROR(IF(AND(I83>$I$159,G83>$G$159),\"Star\",IF(AND(I83>$I$159,G83<$G$159),\"Puzzle\",IF(AND(I83<$I$159,G83>$G$159),\"Plow Horse\",\"Dog\"))),\"\")","v":"Dog"},{"$f":"IFERROR(VLOOKUP(B83,'Cat 3 Setup'!$A:$F,4,FALSE),\"\")","v":""},{"$f":"IFERROR(VLOOKUP(B83,'Cat 3 Setup'!$A:$F,3,FALSE),\"\")","v":0},{"$f":"IFERROR(VLOOKUP(B83,'Cat 3 Setup'!$A:$F,6,FALSE),\"\")","v":""},{"$f":"IFERROR(E83/$E$159,\"\")","v":""},{"$f":"IFERROR(F83/D83,\"\")","v":""},{"$f":"IFERROR((J83-L83)/J83,\"\")","v":""},{"$f":"IFERROR(D83/E83,\"\")","v":""},{"$f":"IFERROR(E83/$F$3,\"\")","v":""},{"$f":"IFERROR(J83*H83,\"\")","v":""}]
["Proposed",null,{"$f":"IFERROR(IF(AND(I84>$I$160,G84>$G$160),\"Star\",IF(AND(I84>$I$160,G84<$G$160),\"Puzzle\",IF(AND(I84<$I$160,G84>$G$160),\"Plow Horse\",\"Dog\"))),\"\")","v":"Dog"},{"$f":"IFERROR(IF(J84=\"\",D83,E84*J84),D83)","v":""},{"$f":"IFERROR(IF(K84=\"\",E83,K84*$F$3),E83)","v":0},{"$f":"IFERROR(D84*H84,F83)","v":""},{"$f":"IFERROR(IF(E84=\"\",G83,E84/$E$160),G83)","v":""},{"$f":"IFERROR(IF(L84=\"\",H83,L84/J84),H83)","v":""},{"$f":"IFERROR((J84-L84)/J84,\"\")","v":""},{"$f":"J83","v":""},{"$f":"K83","v":""},{"$f":"L83","v":""}]
[]
["Baseline",{"$f":"'Cat 3 Setup'!A35","v":0},{"$f":"IFERROR(IF(AND(I86>$I$159,G86>$G$159),\"Star\",IF(AND(I86>$I$159,G86<$G$159),\"Puzzle\",IF(AND(I86<$I$159,G86>$G$159),\"Plow Horse\",\"Dog\"))),\"\")","v":"Dog"},{"$f":"IFERROR(VLOOKUP(B86,'Cat 3 Setup'!$A:$F,4,FALSE),\"\")","v":""},{"$f":"IFERROR(VLOOKUP(B86,'Cat 3 Setup'!$A:$F,3,FALSE),\"\")","v":0},{"$f":"IFERROR(VLOOKUP(B86,'Cat 3 Setup'!$A:$F,6,FALSE),\"\")","v":""},{"$f":"IFERROR(E86/$E$159,\"\")","v":""},{"$f":"IFERROR(F86/D86,\"\")","v":""},{"$f":"IFERROR((J86-L86)/J86,\"\")","v":""},{"$f":"IFERROR(D86/E86,\"\")","v":""},{"$f":"IFERROR(E86/$F$3,\"\")","v":""},{"$f":"IFERROR(J86*H86,\"\")","v":""}]
["Proposed",null,{"$f":"IFERROR(IF(AND(I87>$I$160,G87>$G$160),\"Star\",IF(AND(I87>$I$160,G87<$G$160),\"Puzzle\",IF(AND(I87<$I$160,G87>$G$160),\"Plow Horse\",\"Dog\"))),\"\")","v":"Dog"},{"$f":"IFERROR(IF(J87=\"\",D86,E87*J87),D86)","v":""},{"$f":"IFERROR(IF(K87=\"\",E86,K87*$F$3),E86)","v":0},{"$f":"IFERROR(D87*H87,F86)","v":""},{"$f":"IFERROR(IF(E87=\"\",G86,E87/$E$160),G86)","v":""},{"$f":"IFERROR(IF(L87=\"\",H86,L87/J87),H86)","v":""},{"$f":"IFERROR((J87-L87)/J87,\"\")","v":""},{"$f":"J86","v":""},{"$f":"K86","v":""},{"$f":"L86","v":""}]
[]
["Baseline",{"$f":"'Cat 3 Setup'!A36","v":0},{"$f":"IFERROR(IF(AND(I89>$I$159,G89>$G$159),\"Star\",IF(AND(I89>$I$159,G89<$G$159),\"Puzzle\",IF(AND(I89<$I$159,G89>$G$159),\"Plow Horse\",\"Dog\"))),\"\")","v":"Dog"},{"$f":"IFERROR(VLOOKUP(B89,'Cat 3 Setup'!$A:$F,4,FALSE),\"\")","v":""},{"$f":"IFERROR(VLOOKUP(B89,'Cat 3 Setup'!$A:$F,3,FALSE),\"\")","v":0},{"$f":"IFERROR(VLOOKUP(B89,'Cat 3 Setup'!$A:$F,6,FALSE),\"\")","v":""},{"$f":"IFERROR(E89/$E$159,\"\")","v":""},{"$f":"IFERROR(F89/D89,\"\")","v":""},{"$f":"IFERROR((J89-L89)/J89,\"\")","v":""},{"$f":"IFERROR(D89/E89,\"\")","v":""},{"$f":"IFERROR(E89/$F$3,\"\")","v":""},{"$f":"IFERROR(J89*H89,\"\")","v":""}]
["Proposed",null,{"$f":"IFERROR(IF(AND(I90>$I$160,G90>$G$160),\"Star\",IF(AND(I90>$I$160,G90<$G$160),\"Puzzle\",IF(AND(I90<$I$160,G90>$G$160),\"Plow Horse\",\"Dog\"))),\"\")","v":"Dog"},{"$f":"IFERROR(IF(J90=\"\",D89,E90*J90),D89)","v":""},{"$f":"IFERROR(IF(K90=\"\",E89,K90*$F$3),E89)","v":0},{"$f":"IFERROR(D90*H90,F89)","v":""},{"$f":"IFERROR(IF(E90=\"\",G89,E90/$E$160),G89)","v":""},{"$f":"IFERROR(IF(L90=\"\",H89,L90/J90),H89)","v":""},{"$f":"IFERROR((J90-L90)/J90,\"\")","v":""},{"$f":"J89","v":""},{"$f":"K89","v":""},{"$f":"L89","v":""}]
[]
["Baseline",{"$f":"'Cat 3 Setup'!A37","v":0},{"$f":"IFERROR(IF(AND(I92>$I$159,G92>$G$159),\"Star\",IF(AND(I92>$I$159,G92<$G$159),\"Puzzle\",IF(AND(I92<$I$159,G92>$G$159),\"Plow Horse\",\"Dog\"))),\"\")","v":"Dog"},{"$f":"IFERROR(VLOOKUP(B92,'Cat 3 Setup'!$A:$F,4,FALSE),\"\")","v":""},{"$f":"IFERROR(VLOOKUP(B92,'Cat 3 Setup'!$A:$F,3,FALSE),\"\")","v":0},{"$f":"IFERROR(VLOOKUP(B92,'Cat 3 Setup'!$A:$F,6,FALSE),\"\")","v":""},{"$f":"IFERROR(E92/$E$159,\"\")","v":""},{"$f":"IFERROR(F92/D92,\"\")","v":""},{"$f":"IFERROR((J92-L92)/J92,\"\")","v":""},{"$f":"IFERROR(D92/E92,\"\")","v":""},{"$f":"IFERROR(E92/$F$3,\"\")","v":""},{"$f":"IFERROR(J92*H92,\"\")","v":""}]
["Proposed",null,{"$f":"IFERROR(IF(AND(I93>$I$160,G93>$G$160),\"Star\",IF(AND(I93>$I$160,G93<$G$160),\"Puzzle\",IF(AND(I93<$I$160,G93>$G$160),\"Plow Horse\",\"Dog\"))),\"\")","v":"Dog"},{"$f":"IFERROR(IF(J93=\"\",D92,E93*J93),D92)","v":""},{"$f":"IFERROR(IF(K93=\"\",E92,K93*$F$3),E92)","v":0},{"$f":"IFERROR(D93*H93,F92)","v":""},{"$f":"IFERROR(IF(E93=\"\",G92,E93/$E$160),G92)","v":""},{"$f":"IFERROR(IF(L93=\"\",H92,L93/J93),H92)","v":""},{"$f":"IFERROR((J93-L93)/J93,\"\")","v":""},{"$f":"J92","v":""},{"$f":"K92","v":""},{"$f":"L92","v":""}]
[]
["Baseline",{"$f":"'Cat 3 Setup'!A38","v":0},{"$f":"IFERROR(IF(AND(I95>$I$159,G95>$G$159),\"Star\",IF(AND(I95>$I$159,G95<$G$159),\"Puzzle\",IF(AND(I95<$I$159,G95>$G$159),\"Plow Horse\",\"Dog\"))),\"\")","v":"Dog"},{"$f":"IFERROR(VLOOKUP(B95,'Cat 3 Setup'!$A:$F,4,FALSE),\"\")","v":""},{"$f":"IFERROR(VLOOKUP(B95,'Cat 3 Setup'!$A:$F,3,FALSE),\"\")","v":0},{"$f":"IFERROR(VLOOKUP(B95,'Cat 3 Setup'!$A:$F,6,FALSE),\"\")","v":""},{"$f":"IFERROR(E95/$E$159,\"\")","v":""},{"$f":"IFERROR(F95/D95,\"\")","v":""},{"$f":"IFERROR((J95-L95)/J95,\"\")","v":""},{"$f":"IFERROR(D95/E95,\"\")","v":""},{"$f":"IFERROR(E95/$F$3,\"\")","v":""},{"$f":"IFERROR(J95*H95,\"\")","v":""}]
["Proposed",null,{"$f":"IFERROR(IF(AND(I96>$I$160,G96>$G$160),\"Star\",IF(AND(I96>$I$160,G96<$G$160),\"Puzzle\",IF(AND(I96<$I$160,G96>$G$160),\"Plow Horse\",\"Dog\"))),\"\")","v":"Dog"},{"$f":"IFERROR(IF(J96=\"\",D95,E96*J96),D95)","v":""},{"$f":"IFERROR(IF(K96=\"\",E95,K96*$F$3),E95)","v":0},{"$f":"IFERROR(D96*H96,F95)","v":""},{"$f":"IFERROR(IF(E96=\"\",G95,E96/$E$160),G95)","v":""},{"$f":"IFERROR(IF(L96=\"\",H95,L96/J96),H95)","v":""},{"$f":"IFERROR((J96-L96)/J96,\"\")","v":""},{"$f":"J95","v":""},{"$f":"K95","v":""},{"$f":"L95","v":""}]
[]
["Baseline",{"$f":"'Cat 3 Setup'!A39","v":0},{"$f":"IFERROR(IF(AND(I98>$I$159,G98>$G$159),\"Star\",IF(AND(I98>$I$159,G98<$G$159),\"Puzzle\",IF(AND(I98<$I$159,G98>$G$159),\"Plow Horse\",\"Dog\"))),\"\")","v":"Dog"},{"$f":"IFERROR(VLOOKUP(B98,'Cat 3 Setup'!$A:$F,4,FALSE),\"\")","v":""},{"$f":"IFERROR(VLOOKUP(B98,'Cat 3 Setup'!$A:$F,3,FALSE),\"\")","v":0},{"$f":"IFERROR(VLOOKUP(B98,'Cat 3 Setup'!$A:$F,6,FALSE),\"\")","v":""},{"$f":"IFERROR(E98/$E$159,\"\")","v":""},{"$f":"IFERROR(F98/D98,\"\")","v":""},{"$f":"IFERROR((J98-L98)/J98,\"\")","v":""},{"$f":"IFERROR(D98/E98,\"\")","v":""},{"$f":"IFERROR(E98/$F$3,\"\")","v":""},{"$f":"IFERROR(J98*H98,\"\")","v":""}]
["Proposed",null,{"$f":"IFERROR(IF(AND(I99>$I$160,G99>$G$160),\"Star\",IF(AND(I99>$I$160,G99<$G$160),\"Puzzle\",IF(AND(I99<$I$160,G99>$G$160),\"Plow Horse\",\"Dog\"))),\"\")","v":"Dog"},{"$f":"IFERROR(IF(J99=\"\",D98,E99*J99),D98)","v":""},{"$f":"IFERROR(IF(K99=\"\",E98,K99*$F$3),E98)","v":0},{"$f":"IFERROR(D99*H99,F98)","v":""},{"$f":"IFERROR(IF(E99=\"\",G98,E99/$E$160),G98)","v":""},{"$f":"IFERROR(IF(L99=\"\",H98,L99/J99),H98)","v":""},{"$f":"IFERROR((J99-L99)/J99,\"\")","v":""},{"$f":"J98","v":""},{"$f":"K98","v":""},{"$f":"L98","v":""}]
[]
["Baseline",{"$f":"'Cat 3 Setup'!A40","v":0},{"$f":"IFERROR(IF(AND(I101>$I$159,G101>$G$159),\"Star\",IF(AND(I101>$I$159,G101<$G$159),\"Puzzle\",IF(AND(I101<$I$159,G101>$G$159),\"Plow Horse\",\"Dog\"))),\"\")","v":"Dog"},{"$f":"IFERROR(VLOOKUP(B101,'Cat 3 Setup'!$A:$F,4,FALSE),\"\")","v":""},{"$f":"IFERROR(VLOOKUP(B101,'Cat 3 Setup'!$A:$F,3,FALSE),\"\")","v":0},{"$f":"IFERROR(VLOOKUP(B101,'Cat 3 Setup'!$A:$F,6,FALSE),\"\")","v":""},{"$f":"IFERROR(E101/$E$159,\"\")","v":""},{"$f":"IFERROR(F101/D101,\"\")","v":""},{"$f":"IFERROR((J101-L101)/J101,\"\")","v":""},{"$f":"IFERROR(D101/E101,\"\")","v":""},{"$f":"IFERROR(E101/$F$3,\"\")","v":""},{"$f":"IFERROR(J101*H101,\"\")","v":""}]
["Proposed",null,{"$f":"IFERROR(IF(AND(I102>$I$160,G102>$G$160),\"Star\",IF(AND(I102>$I$160,G102<$G$160),\"Puzzle\",IF(AND(I102<$I$160,G102>$G$160),\"Plow Horse\",\"Dog\"))),\"\")","v":"Dog"},{"$f":"IFERROR(IF(J102=\"\",D101,E102*J102),D101)","v":""},{"$f":"IFERROR(IF(K102=\"\",E101,K102*$F$3),E101)","v":0},{"$f":"IFERROR(D102*H102,F101)","v":""},{"$f":"IFERROR(IF(E102=\"\",G101,E102/$E$160),G101)","v":""},{"$f":"IFERROR(IF(L102=\"\",H101,L102/J102),H101)","v":""},{"$f":"IFERROR((J102-L102)/J102,\"\")","v":""},{"$f":"J101","v":""},{"$f":"K101","v":""},{"$f":"L101","v":""}]
[]
["Baseline",{"$f":"'Cat 3 Setup'!A41","v":0},{"$f":"IFERROR(IF(AND(I104>$I$159,G104>$G$159),\"Star\",IF(AND(I104>$I$159,G104<$G$159),\"Puzzle\",IF(AND(I104<$I$159,G104>$G$159),\"Plow Horse\",\"Dog\"))),\"\")","v":"Dog"},{"$f":"IFERROR(VLOOKUP(B104,'Cat 3 Setup'!$A:$F,4,FALSE),\"\")","v":""},{"$f":"IFERROR(VLOOKUP(B104,'Cat 3 Setup'!$A:$F,3,FALSE),\"\")","v":0},{"$f":"IFERROR(VLOOKUP(B104,'Cat 3 Setup'!$A:$F,6,FALSE),\"\")","v":""},{"$f":"IFERROR(E104/$E$159,\"\")","v":""},{"$f":"IFERROR(F104/D104,\"\")","v":""},{"$f":"IFERROR((J104-L104)/J104,\"\")","v":""},{"$f":"IFERROR(D104/E104,\"\")","v":""},{"$f":"IFERROR(E104/$F$3,\"\")","v":""},{"$f":"IFERROR(J104*H104,\"\")","v":""}]
["Proposed",null,{"$f":"IFERROR(IF(AND(I105>$I$160,G105>$G$160),\"Star\",IF(AND(I105>$I$160,G105<$G$160),\"Puzzle\",IF(AND(I105<$I$160,G105>$G$160),\"Plow Horse\",\"Dog\"))),\"\")","v":"Dog"},{"$f":"IFERROR(IF(J105=\"\",D104,E105*J105),D104)","v":""},{"$f":"IFERROR(IF(K105=\"\",E104,K105*$F$3),E104)","v":0},{"$f":"IFERROR(D105*H105,F104)","v":""},{"$f":"IFERROR(IF(E105=\"\",G104,E105/$E$160),G104)","v":""},{"$f":"IFERROR(IF(L105=\"\",H104,L105/J105),H104)","v":""},{"$f":"IFERROR((J105-L105)/J105,\"\")","v":""},{"$f":"J104","v":""},{"$f":"K104","v":""},{"$f":"L104","v":""}]
[]
["Baseline",{"$f":"'Cat 3 Setup'!A42","v":0},{"$f":"IFERROR(IF(AND(I107>$I$159,G107>$G$159),\"Star\",IF(AND(I107>$I$159,G107<$G$159),\"Puzzle\",IF(AND(I107<$I$159,G107>$G$159),\"Plow Horse\",\"Dog\"))),\"\")","v":"Dog"},{"$f":"IFERROR(VLOOKUP(B107,'Cat 3 Setup'!$A:$F,4,FALSE),\"\")","v":""},{"$f":"IFERROR(VLOOKUP(B107,'Cat 3 Setup'!$A:$F,3,FALSE),\"\")","v":0},{"$f":"IFERROR(VLOOKUP(B107,'Cat 3 Setup'!$A:$F,6,FALSE),\"\")","v":""},{"$f":"IFERROR(E107/$E$159,\"\")","v":""},{"$f":"IFERROR(F107/D107,\"\")","v":""},{"$f":"IFERROR((J107-L107)/J107,\"\")","v":""},{"$f":"IFERROR(D107/E107,\"\")","v":""},{"$f":"IFERROR(E107/$F$3,\"\")","v":""},{"$f":"IFERROR(J107*H107,\"\")","v":""}]
["Proposed",null,{"$f":"IFERROR(IF(AND(I108>$I$160,G108>$G$160),\"Star\",IF(AND(I108>$I$160,G108<$G$160),\"Puzzle\",IF(AND(I108<$I$160,G108>$G$160),\"Plow Horse\",\"Dog\"))),\"\")","v":"Dog"},{"$f":"IFERROR(IF(J108=\"\",D107,E108*J108),D107)","v":""},{"$f":"IFERROR(IF(K108=\"\",E107,K108*$F$3),E107)","v":0},{"$f":"IFERROR(D108*H108,F107)","v":""},{"$f":"IFERROR(IF(E108=\"\",G107,E108/$E$160),G107)","v":""},{"$f":"IFERROR(IF(L108=\"\",H107,L108/J108),H107)","v":""},{"$f":"IFERROR((J108-L108)/J108,\"\")","v":""},{"$f":"J107","v":""},{"$f":"K107","v":""},{"$f":"L107","v":""}]
[]
["Baseline",{"$f":"'Cat 3 Setup'!A43","v":0},{"$f":"IFERROR(IF(AND(I110>$I$159,G110>$G$159),\"Star\",IF(AND(I110>$I$159,G110<$G$159),\"Puzzle\",IF(AND(I110<$I$159,G110>$G$159),\"Plow Horse\",\"Dog\"))),\"\")","v":"Dog"},{"$f":"IFERROR(VLOOKUP(B110,'Cat 3 Setup'!$A:$F,4,FALSE),\"\")","v":""},{"$f":"IFERROR(VLOOKUP(B110,'Cat 3 Setup'!$A:$F,3,FALSE),\"\")","v":0},{"$f":"IFERROR(VLOOKUP(B110,'Cat 3 Setup'!$A:$F,6,FALSE),\"\")","v":""},{"$f":"IFERROR(E110/$E$159,\"\")","v":""},{"$f":"IFERROR(F110/D110,\"\")","v":""},{"$f":"IFERROR((J110-L110)/J110,\"\")","v":""},{"$f":"IFERROR(D110/E110,\"\")","v":""},{"$f":"IFERROR(E110/$F$3,\"\")","v":""},{"$f":"IFERROR(J110*H110,\"\")","v":""}]
["Proposed",null,{"$f":"IFERROR(IF(AND(I111>$I$160,G111>$G$160),\"Star\",IF(AND(I111>$I$160,G111<$G$160),\"Puzzle\",IF(AND(I111<$I$160,G111>$G$160),\"Plow Horse\",\"Dog\"))),\"\")","v":"Dog"},{"$f":"IFERROR(IF(J111=\"\",D110,E111*J111),D110)","v":""},{"$f":"IFERROR(IF(K111=\"\",E110,K111*$F$3),E110)","v":0},{"$f":"IFERROR(D111*H111,F110)","v":""},{"$f":"IFERROR(IF(E111=\"\",G110,E111/$E$160),G110)","v":""},{"$f":"IFERROR(IF(L111=\"\",H110,L111/J111),H110)","v":""},{"$f":"IFERROR((J111-L111)/J111,\"\")","v":""},{"$f":"J110","v":""},{"$f":"K110","v":""},{"$f":"L110","v":""}]
[]
["Baseline",{"$f":"'Cat 3 Setup'!A44","v":0},{"$f":"IFERROR(IF(AND(I113>$I$159,G113>$G$159),\"Star\",IF(AND(I113>$I$159,G113<$G$159),\"Puzzle\",IF(AND(I113<$I$159,G113>$G$159),\"Plow Horse\",\"Dog\"))),\"\")","v":"Dog"},{"$f":"IFERROR(VLOOKUP(B113,'Cat 3 Setup'!$A:$F,4,FALSE),\"\")","v":""},{"$f":"IFERROR(VLOOKUP(B113,'Cat 3 Setup'!$A:$F,3,FALSE),\"\")","v":0},{"$f":"IFERROR(VLOOKUP(B113,'Cat 3 Setup'!$A:$F,6,FALSE),\"\")","v":""},{"$f":"IFERROR(E113/$E$159,\"\")","v":""},{"$f":"IFERROR(F113/D113,\"\")","v":""},{"$f":"IFERROR((J113-L113)/J113,\"\")","v":""},{"$f":"IFERROR(D113/E113,\"\")","v":""},{"$f":"IFERROR(E113/$F$3,\"\")","v":""},{"$f":"IFERROR(J113*H113,\"\")","v":""}]
["Proposed",null,{"$f":"IFERROR(IF(AND(I114>$I$160,G114>$G$160),\"Star\",IF(AND(I114>$I$160,G114<$G$160),\"Puzzle\",IF(AND(I114<$I$160,G114>$G$160),\"Plow Horse\",\"Dog\"))),\"\")","v":"Dog"},{"$f":"IFERROR(IF(J114=\"\",D113,E114*J114),D113)","v":""},{"$f":"IFERROR(IF(K114=\"\",E113,K114*$F$3),E113)","v":0},{"$f":"IFERROR(D114*H114,F113)","v":""},{"$f":"IFERROR(IF(E114=\"\",G113,E114/$E$160),G113)","v":""},{"$f":"IFERROR(IF(L114=\"\",H113,L114/J114),H113)","v":""},{"$f":"IFERROR((J114-L114)/J114,\"\")","v":""},{"$f":"J113","v":""},{"$f":"K113","v":""},{"$f":"L113","v":""}]
[]
["Baseline",{"$f":"'Cat 3 Setup'!A45","v":0},{"$f":"IFERROR(IF(AND(I116>$I$159,G116>$G$159),\"Star\",IF(AND(I116>$I$159,G116<$G$159),\"Puzzle\",IF(AND(I116<$I$159,G116>$G$159),\"Plow Horse\",\"Dog\"))),\"\")","v":"Dog"},{"$f":"IFERROR(VLOOKUP(B116,'Cat 3 Setup'!$A:$F,4,FALSE),\"\")","v":""},{"$f":"IFERROR(VLOOKUP(B116,'Cat 3 Setup'!$A:$F,3,FALSE),\"\")","v":0},{"$f":"IFERROR(VLOOKUP(B116,'Cat 3 Setup'!$A:$F,6,FALSE),\"\")","v":""},{"$f":"IFERROR(E116/$E$159,\"\")","v":""},{"$f":"IFERROR(F116/D116,\"\")","v":""},{"$f":"IFERROR((J116-L116)/J116,\"\")","v":""},{"$f":"IFERROR(D116/E116,\"\")","v":""},{"$f":"IFERROR(E116/$F$3,\"\")","v":""},{"$f":"IFERROR(J116*H116,\"\")","v":""}]
["Proposed",null,{"$f":"IFERROR(IF(AND(I117>$I$160,G117>$G$160),\"Star\",IF(AND(I117>$I$160,G117<$G$160),\"Puzzle\",IF(AND(I117<$I$160,G117>$G$160),\"Plow Horse\",\"Dog\"))),\"\")","v":"Dog"},{"$f":"IFERROR(IF(J117=\"\",D116,E117*J117),D116)","v":""},{"$f":"IFERROR(IF(K117=\"\",E116,K117*$F$3),E116)","v":0},{"$f":"IFERROR(D117*H117,F116)","v":""},{"$f":"IFERROR(IF(E117=\"\",G116,E117/$E$160),G116)","v":""},{"$f":"IFERROR(IF(L117=\"\",H116,L117/J117),H116)","v":""},{"$f":"IFERROR((J117-L117)/J117,\"\")","v":""},{"$f":"J116","v":""},{"$f":"K116","v":""},{"$f":"L116","v":""}]
[]
["Baseline",{"$f":"'Cat 3 Setup'!A46","v":0},{"$f":"IFERROR(IF(AND(I119>$I$159,G119>$G$159),\"Star\",IF(AND(I119>$I$159,G119<$G$159),\"Puzzle\",IF(AND(I119<$I$159,G119>$G$159),\"Plow Horse\",\"Dog\"))),\"\")","v":"Dog"},{"$f":"IFERROR(VLOOKUP(B119,'Cat 3 Setup'!$A:$F,4,FALSE),\"\")","v":""},{"$f":"IFERROR(VLOOKUP(B119,'Cat 3 Setup'!$A:$F,3,FALSE),\"\")","v":0},{"$f":"IFERROR(VLOOKUP(B119,'Cat 3 Setup'!$A:$F,6,FALSE),\"\")","v":""},{"$f":"IFERROR(E119/$E$159,\"\")","v":""},{"$f":"IFERROR(F119/D119,\"\")","v":""},{"$f":"IFERROR((J119-L119)/J119,\"\")","v":""},{"$f":"IFERROR(D119/E119,\"\")","v":""},{"$f":"IFERROR(E119/$F$3,\"\")","v":""},{"$f":"IFERROR(J119*H119,\"\")","v":""}]
["Proposed",null,{"$f":"IFERROR(IF(AND(I120>$I$160,G120>$G$160),\"Star\",IF(AND(I120>$I$160,G120<$G$160),\"Puzzle\",IF(AND(I120<$I$160,G120>$G$160),\"Plow Horse\",\"Dog\"))),\"\")","v":"Dog"},{"$f":"IFERROR(IF(J120=\"\",D119,E120*J120),D119)","v":""},{"$f":"IFERROR(IF(K120=\"\",E119,K120*$F$3),E119)","v":0},{"$f":"IFERROR(D120*H120,F119)","v":""},{"$f":"IFERROR(IF(E120=\"\",G119,E120/$E$160),G119)","v":""},{"$f":"IFERROR(IF(L120=\"\",H119,L120/J120),H119)","v":""},{"$f":"IFERROR((J120-L120)/J120,\"\")","v":""},{"$f":"J119","v":""},{"$f":"K119","v":""},{"$f":"L119","v":""}]
[]
["Baseline",{"$f":"'Cat 3 Setup'!A47","v":0},{"$f":"IFERROR(IF(AND(I122>$I$159,G122>$G$159),\"Star\",IF(AND(I122>$I$159,G122<$G$159),\"Puzzle\",IF(AND(I122<$I$159,G122>$G$159),\"Plow Horse\",\"Dog\"))),\"\")","v":"Dog"},{"$f":"IFERROR(VLOOKUP(B122,'Cat 3 Setup'!$A:$F,4,FALSE),\"\")","v":""},{"$f":"IFERROR(VLOOKUP(B122,'Cat 3 Setup'!$A:$F,3,FALSE),\"\")","v":0},{"$f":"IFERROR(VLOOKUP(B122,'Cat 3 Setup'!$A:$F,6,FALSE),\"\")","v":""},{"$f":"IFERROR(E122/$E$159,\"\")","v":""},{"$f":"IFERROR(F122/D122,\"\")","v":""},{"$f":"IFERROR((J122-L122)/J122,\"\")","v":""},{"$f":"IFERROR(D122/E122,\"\")","v":""},{"$f":"IFERROR(E122/$F$3,\"\")","v":""},{"$f":"IFERROR(J122*H122,\"\")","v":""}]
["Proposed",null,{"$f":"IFERROR(IF(AND(I123>$I$160,G123>$G$160),\"Star\",IF(AND(I123>$I$160,G123<$G$160),\"Puzzle\",IF(AND(I123<$I$160,G123>$G$160),\"Plow Horse\",\"Dog\"))),\"\")","v":"Dog"},{"$f":"IFERROR(IF(J123=\"\",D122,E123*J123),D122)","v":""},{"$f":"IFERROR(IF(K123=\"\",E122,K123*$F$3),E122)","v":0},{"$f":"IFERROR(D123*H123,F122)","v":""},{"$f":"IFERROR(IF(E123=\"\",G122,E123/$E$160),G122)","v":""},{"$f":"IFERROR(IF(L123=\"\",H122,L123/J123),H122)","v":""},"",{"$f":"J122","v":""},{"$f":"K122","v":""},{"$f":"L122","v":""}]
[]
["Baseline",{"$f":"'Cat 3 Setup'!A48","v":0},{"$f":"IFERROR(IF(AND(I125>$I$159,G125>$G$159),\"Star\",IF(AND(I125>$I$159,G125<$G$159),\"Puzzle\",IF(AND(I125<$I$159,G125>$G$159),\"Plow Horse\",\"Dog\"))),\"\")","v":"Dog"},{"$f":"IFERROR(VLOOKUP(B125,'Cat 3 Setup'!$A:$F,4,FALSE),\"\")","v":""},{"$f":"IFERROR(VLOOKUP(B125,'Cat 3 Setup'!$A:$F,3,FALSE),\"\")","v":0},{"$f":"IFERROR(VLOOKUP(B125,'Cat 3 Setup'!$A:$F,6,FALSE),\"\")","v":""},{"$f":"IFERROR(E125/$E$159,\"\")","v":""},{"$f":"IFERROR(F125/D125,\"\")","v":""},{"$f":"IFERROR((J125-L125)/J125,\"\")","v":""},{"$f":"IFERROR(D125/E125,\"\")","v":""},{"$f":"IFERROR(E125/$F$3,\"\")","v":""},{"$f":"IFERROR(J125*H125,\"\")","v":""}]
["Proposed",null,{"$f":"IFERROR(IF(AND(I126>$I$160,G126>$G$160),\"Star\",IF(AND(I126>$I$160,G126<$G$160),\"Puzzle\",IF(AND(I126<$I$160,G126>$G$160),\"Plow Horse\",\"Dog\"))),\"\")","v":"Dog"},{"$f":"IFERROR(IF(J126=\"\",D125,E126*J126),D125)","v":""},{"$f":"IFERROR(IF(K126=\"\",E125,K126*$F$3),E125)","v":0},{"$f":"IFERROR(D126*H126,F125)","v":""},{"$f":"IFERROR(IF(E126=\"\",G125,E126/$E$160),G125)","v":""},{"$f":"IFERROR(IF(L126=\"\",H125,L126/J126),H125)","v":""},"",{"$f":"J125","v":""},{"$f":"K125","v":""},{"$f":"L125","v":""}]
[]
["Baseline",{"$f":"'Cat 3 Setup'!A49","v":0},{"$f":"IFERROR(IF(AND(I128>$I$159,G128>$G$159),\"Star\",IF(AND(I128>$I$159,G128<$G$159),\"Puzzle\",IF(AND(I128<$I$159,G128>$G$159),\"Plow Horse\",\"Dog\"))),\"\")","v":"Dog"},{"$f":"IFERROR(VLOOKUP(B128,'Cat 3 Setup'!$A:$F,4,FALSE),\"\")","v":""},{"$f":"IFERROR(VLOOKUP(B128,'Cat 3 Setup'!$A:$F,3,FALSE),\"\")","v":0},{"$f":"IFERROR(VLOOKUP(B128,'Cat 3 Setup'!$A:$F,6,FALSE),\"\")","v":""},{"$f":"IFERROR(E128/$E$159,\"\")","v":""},{"$f":"IFERROR(F128/D128,\"\")","v":""},{"$f":"IFERROR((J128-L128)/J128,\"\")","v":""},{"$f":"IFERROR(D128/E128,\"\")","v":""},{"$f":"IFERROR(E128/$F$3,\"\")","v":""},{"$f":"IFERROR(J128*H128,\"\")","v":""}]
["Proposed",null,{"$f":"IFERROR(IF(AND(I129>$I$160,G129>$G$160),\"Star\",IF(AND(I129>$I$160,G129<$G$160),\"Puzzle\",IF(AND(I129<$I$160,G129>$G$160),\"Plow Horse\",\"Dog\"))),\"\")","v":"Dog"},{"$f":"IFERROR(IF(J129=\"\",D128,E129*J129),D128)","v":""},{"$f":"IFERROR(IF(K129=\"\",E128,K129*$F$3),E128)","v":0},{"$f":"IFERROR(D129*H129,F128)","v":""},{"$f":"IFERROR(IF(E129=\"\",G128,E129/$E$160),G128)","v":""},{"$f":"IFERROR(IF(L129=\"\",H128,L129/J129),H128)","v":""},"",{"$f":"J128","v":""},{"$f":"K128","v":""},{"$f":"L128","v":""}]
[]
["Baseline",{"$f":"'Cat 3 Setup'!A50","v":0},{"$f":"IFERROR(IF(AND(I131>$I$159,G131>$G$159),\"Star\",IF(AND(I131>$I$159,G131<$G$159),\"Puzzle\",IF(AND(I131<$I$159,G131>$G$159),\"Plow Horse\",\"Dog\"))),\"\")","v":"Dog"},{"$f":"IFERROR(VLOOKUP(B131,'Cat 3 Setup'!$A:$F,4,FALSE),\"\")","v":""},{"$f":"IFERROR(VLOOKUP(B131,'Cat 3 Setup'!$A:$F,3,FALSE),\"\")","v":0},{"$f":"IFERROR(VLOOKUP(B131,'Cat 3 Setup'!$A:$F,6,FALSE),\"\")","v":""},{"$f":"IFERROR(E131/$E$159,\"\")","v":""},{"$f":"IFERROR(F131/D131,\"\")","v":""},{"$f":"IFERROR((J131-L131)/J131,\"\")","v":""},{"$f":"IFERROR(D131/E131,\"\")","v":""},{"$f":"IFERROR(E131/$F$3,\"\")","v":""},{"$f":"IFERROR(J131*H131,\"\")","v":""}]
["Proposed",null,{"$f":"IFERROR(IF(AND(I132>$I$160,G132>$G$160),\"Star\",IF(AND(I132>$I$160,G132<$G$160),\"Puzzle\",IF(AND(I132<$I$160,G132>$G$160),\"Plow Horse\",\"Dog\"))),\"\")","v":"Dog"},{"$f":"IFERROR(IF(J132=\"\",D131,E132*J132),D131)","v":""},{"$f":"IFERROR(IF(K132=\"\",E131,K132*$F$3),E131)","v":0},{"$f":"IFERROR(D132*H132,F131)","v":""},{"$f":"IFERROR(IF(E132=\"\",G131,E132/$E$160),G131)","v":""},{"$f":"IFERROR(IF(L132=\"\",H131,L132/J132),H131)","v":""},"",{"$f":"J131","v":""},{"$f":"K131","v":""},{"$f":"L131","v":""}]
[]
["Baseline",{"$f":"'Cat 3 Setup'!A51","v":0},{"$f":"IFERROR(IF(AND(I134>$I$159,G134>$G$159),\"Star\",IF(AND(I134>$I$159,G134<$G$159),\"Puzzle\",IF(AND(I134<$I$159,G134>$G$159),\"Plow Horse\",\"Dog\"))),\"\")","v":"Dog"},{"$f":"IFERROR(VLOOKUP(B134,'Cat 3 Setup'!$A:$F,4,FALSE),\"\")","v":""},{"$f":"IFERROR(VLOOKUP(B134,'Cat 3 Setup'!$A:$F,3,FALSE),\"\")","v":0},{"$f":"IFERROR(VLOOKUP(B134,'Cat 3 Setup'!$A:$F,6,FALSE),\"\")","v":""},{"$f":"IFERROR(E134/$E$159,\"\")","v":""},{"$f":"IFERROR(F134/D134,\"\")","v":""},{"$f":"IFERROR((J134-L134)/J134,\"\")","v":""},{"$f":"IFERROR(D134/E134,\"\")","v":""},{"$f":"IFERROR(E134/$F$3,\"\")","v":""},{"$f":"IFERROR(J134*H134,\"\")","v":""}]
["Proposed",null,{"$f":"IFERROR(IF(AND(I135>$I$160,G135>$G$160),\"Star\",IF(AND(I135>$I$160,G135<$G$160),\"Puzzle\",IF(AND(I135<$I$160,G135>$G$160),\"Plow Horse\",\"Dog\"))),\"\")","v":"Dog"},{"$f":"IFERROR(IF(J135=\"\",D134,E135*J135),D134)","v":""},{"$f":"IFERROR(IF(K135=\"\",E134,K135*$F$3),E134)","v":0},{"$f":"IFERROR(D135*H135,F134)","v":""},{"$f":"IFERROR(IF(E135=\"\",G134,E135/$E$160),G134)","v":""},{"$f":"IFERROR(IF(L135=\"\",H134,L135/J135),H134)","v":""},"",{"$f":"J134","v":""},{"$f":"K134","v":""},{"$f":"L134","v":""}]
[]
["Baseline",{"$f":"'Cat 3 Setup'!A52","v":0},{"$f":"IFERROR(IF(AND(I137>$I$159,G137>$G$159),\"Star\",IF(AND(I137>$I$159,G137<$G$159),\"Puzzle\",IF(AND(I137<$I$159,G137>$G$159),\"Plow Horse\",\"Dog\"))),\"\")","v":"Dog"},{"$f":"IFERROR(VLOOKUP(B137,'Cat 3 Setup'!$A:$F,4,FALSE),\"\")","v":""},{"$f":"IFERROR(VLOOKUP(B137,'Cat 3 Setup'!$A:$F,3,FALSE),\"\")","v":0},{"$f":"IFERROR(VLOOKUP(B137,'Cat 3 Setup'!$A:$F,6,FALSE),\"\")","v":""},{"$f":"IFERROR(E137/$E$159,\"\")","v":""},{"$f":"IFERROR(F137/D137,\"\")","v":""},{"$f":"IFERROR((J137-L137)/J137,\"\")","v":""},{"$f":"IFERROR(D137/E137,\"\")","v":""},{"$f":"IFERROR(E137/$F$3,\"\")","v":""},{"$f":"IFERROR(J137*H137,\"\")","v":""}]
["Proposed",null,{"$f":"IFERROR(IF(AND(I138>$I$160,G138>$G$160),\"Star\",IF(AND(I138>$I$160,G138<$G$160),\"Puzzle\",IF(AND(I138<$I$160,G138>$G$160),\"Plow Horse\",\"Dog\"))),\"\")","v":"Dog"},{"$f":"IFERROR(IF(J138=\"\",D137,E138*J138),D137)","v":""},{"$f":"IFERROR(IF(K138=\"\",E137,K138*$F$3),E137)","v":0},{"$f":"IFERROR(D138*H138,F137)","v":""},{"$f":"IFERROR(IF(E138=\"\",G137,E138/$E$160),G137)","v":""},{"$f":"IFERROR(IF(L138=\"\",H137,L138/J138),H137)","v":""},"",{"$f":"J137","v":""},{"$f":"K137","v":""},{"$f":"L137","v":""}]
[]
["Baseline",{"$f":"'Cat 3 Setup'!A53","v":0},{"$f":"IFERROR(IF(AND(I140>$I$159,G140>$G$159),\"Star\",IF(AND(I140>$I$159,G140<$G$159),\"Puzzle\",IF(AND(I140<$I$159,G140>$G$159),\"Plow Horse\",\"Dog\"))),\"\")","v":"Dog"},{"$f":"IFERROR(VLOOKUP(B140,'Cat 3 Setup'!$A:$F,4,FALSE),\"\")","v":""},{"$f":"IFERROR(VLOOKUP(B140,'Cat 3 Setup'!$A:$F,3,FALSE),\"\")","v":0},{"$f":"IFERROR(VLOOKUP(B140,'Cat 3 Setup'!$A:$F,6,FALSE),\"\")","v":""},{"$f":"IFERROR(E140/$E$159,\"\")","v":""},{"$f":"IFERROR(F140/D140,\"\")","v":""},{"$f":"IFERROR((J140-L140)/J140,\"\")","v":""},{"$f":"IFERROR(D140/E140,\"\")","v":""},{"$f":"IFERROR(E140/$F$3,\"\")","v":""},{"$f":"IFERROR(J140*H140,\"\")","v":""}]
["Proposed",null,{"$f":"IFERROR(IF(AND(I141>$I$160,G141>$G$160),\"Star\",IF(AND(I141>$I$160,G141<$G$160),\"Puzzle\",IF(AND(I141<$I$160,G141>$G$160),\"Plow Horse\",\"Dog\"))),\"\")","v":"Dog"},{"$f":"IFERROR(IF(J141=\"\",D140,E141*J141),D140)","v":""},{"$f":"IFERROR(IF(K141=\"\",E140,K141*$F$3),E140)","v":0},{"$f":"IFERROR(D141*H141,F140)","v":""},{"$f":"IFERROR(IF(E141=\"\",G140,E141/$E$160),G140)","v":""},{"$f":"IFERROR(IF(L141=\"\",H140,L141/J141),H140)","v":""},"",{"$f":"J140","v":""},{"$f":"K140","v":""},{"$f":"L140","v":""}]
[]
["Baseline",{"$f":"'Cat 3 Setup'!A54","v":0},{"$f":"IFERROR(IF(AND(I143>$I$159,G143>$G$159),\"Star\",IF(AND(I143>$I$159,G143<$G$159),\"Puzzle\",IF(AND(I143<$I$159,G143>$G$159),\"Plow Horse\",\"Dog\"))),\"\")","v":"Dog"},{"$f":"IFERROR(VLOOKUP(B143,'Cat 3 Setup'!$A:$F,4,FALSE),\"\")","v":""},{"$f":"IFERROR(VLOOKUP(B143,'Cat 3 Setup'!$A:$F,3,FALSE),\"\")","v":0},{"$f":"IFERROR(VLOOKUP(B143,'Cat 3 Setup'!$A:$F,6,FALSE),\"\")","v":""},{"$f":"IFERROR(E143/$E$159,\"\")","v":""},{"$f":"IFERROR(F143/D143,\"\")","v":""},{"$f":"IFERROR((J143-L143)/J143,\"\")","v":""},{"$f":"IFERROR(D143/E143,\"\")","v":""},{"$f":"IFERROR(E143/$F$3,\"\")","v":""},{"$f":"IFERROR(J143*H143,\"\")","v":""}]
["Proposed",null,{"$f":"IFERROR(IF(AND(I144>$I$160,G144>$G$160),\"Star\",IF(AND(I144>$I$160,G144<$G$160),\"Puzzle\",IF(AND(I144<$I$160,G144>$G$160),\"Plow Horse\",\"Dog\"))),\"\")","v":"Dog"},{"$f":"IFERROR(IF(J144=\"\",D143,E144*J144),D143)","v":""},{"$f":"IFERROR(IF(K144=\"\",E143,K144*$F$3),E143)","v":0},{"$f":"IFERROR(D144*H144,F143)","v":""},{"$f":"IFERROR(IF(E144=\"\",G143,E144/$E$160),G143)","v":""},{"$f":"IFERROR(IF(L144=\"\",H143,L144/J144),H143)","v":""},"",{"$f":"J143","v":""},{"$f":"K143","v":""},{"$f":"L143","v":""}]
[]
["Baseline",{"$f":"'Cat 3 Setup'!A55","v":0},{"$f":"IFERROR(IF(AND(I146>$I$159,G146>$G$159),\"Star\",IF(AND(I146>$I$159,G146<$G$159),\"Puzzle\",IF(AND(I146<$I$159,G146>$G$159),\"Plow Horse\",\"Dog\"))),\"\")","v":"Dog"},{"$f":"IFERROR(VLOOKUP(B146,'Cat 3 Setup'!$A:$F,4,FALSE),\"\")","v":""},{"$f":"IFERROR(VLOOKUP(B146,'Cat 3 Setup'!$A:$F,3,FALSE),\"\")","v":0},{"$f":"IFERROR(VLOOKUP(B146,'Cat 3 Setup'!$A:$F,6,FALSE),\"\")","v":""},{"$f":"IFERROR(E146/$E$159,\"\")","v":""},{"$f":"IFERROR(F146/D146,\"\")","v":""},{"$f":"IFERROR((J146-L146)/J146,\"\")","v":""},{"$f":"IFERROR(D146/E146,\"\")","v":""},{"$f":"IFERROR(E146/$F$3,\"\")","v":""},{"$f":"IFERROR(J146*H146,\"\")","v":""}]
["Proposed",null,{"$f":"IFERROR(IF(AND(I147>$I$160,G147>$G$160),\"Star\",IF(AND(I147>$I$160,G147<$G$160),\"Puzzle\",IF(AND(I147<$I$160,G147>$G$160),\"Plow Horse\",\"Dog\"))),\"\")","v":"Dog"},{"$f":"IFERROR(IF(J147=\"\",D146,E147*J147),D146)","v":""},{"$f":"IFERROR(IF(K147=\"\",E146,K147*$F$3),E146)","v":0},{"$f":"IFERROR(D147*H147,F146)","v":""},{"$f":"IFERROR(IF(E147=\"\",G146,E147/$E$160),G146)","v":""},{"$f":"IFERROR(IF(L147=\"\",H146,L147/J147),H146)","v":""},"",{"$f":"J146","v":""},{"$f":"K146","v":""},{"$f":"L146","v":""}]
[]
["Baseline",{"$f":"'Cat 3 Setup'!A56","v":0},{"$f":"IFERROR(IF(AND(I149>$I$159,G149>$G$159),\"Star\",IF(AND(I149>$I$159,G149<$G$159),\"Puzzle\",IF(AND(I149<$I$159,G149>$G$159),\"Plow Horse\",\"Dog\"))),\"\")","v":"Dog"},{"$f":"IFERROR(VLOOKUP(B149,'Cat 3 Setup'!$A:$F,4,FALSE),\"\")","v":""},{"$f":"IFERROR(VLOOKUP(B149,'Cat 3 Setup'!$A:$F,3,FALSE),\"\")","v":0},{"$f":"IFERROR(VLOOKUP(B149,'Cat 3 Setup'!$A:$F,6,FALSE),\"\")","v":""},{"$f":"IFERROR(E149/$E$159,\"\")","v":""},{"$f":"IFERROR(F149/D149,\"\")","v":""},{"$f":"IFERROR((J149-L149)/J149,\"\")","v":""},{"$f":"IFERROR(D149/E149,\"\")","v":""},{"$f":"IFERROR(E149/$F$3,\"\")","v":""},{"$f":"IFERROR(J149*H149,\"\")","v":""}]
["Proposed",null,{"$f":"IFERROR(IF(AND(I150>$I$160,G150>$G$160),\"Star\",IF(AND(I150>$I$160,G150<$G$160),\"Puzzle\",IF(AND(I150<$I$160,G150>$G$160),\"Plow Horse\",\"Dog\"))),\"\")","v":"Dog"},{"$f":"IFERROR(IF(J150=\"\",D149,E150*J150),D149)","v":""},{"$f":"IFERROR(IF(K150=\"\",E149,K150*$F$3),E149)","v":0},{"$f":"IFERROR(D150*H150,F149)","v":""},{"$f":"IFERROR(IF(E150=\"\",G149,E150/$E$160),G149)","v":""},{"$f":"IFERROR(IF(L150=\"\",H149,L150/J150),H149)","v":""},"",{"$f":"J149","v":""},{"$f":"K149","v":""},{"$f":"L149","v":""}]
[]
["Baseline",{"$f":"'Cat 3 Setup'!A57","v":0},{"$f":"IFERROR(IF(AND(I152>$I$159,G152>$G$159),\"Star\",IF(AND(I152>$I$159,G152<$G$159),\"Puzzle\",IF(AND(I152<$I$159,G152>$G$159),\"Plow Horse\",\"Dog\"))),\"\")","v":"Dog"},{"$f":"IFERROR(VLOOKUP(B152,'Cat 3 Setup'!$A:$F,4,FALSE),\"\")","v":""},{"$f":"IFERROR(VLOOKUP(B152,'Cat 3 Setup'!$A:$F,3,FALSE),\"\")","v":0},{"$f":"IFERROR(VLOOKUP(B152,'Cat 3 Setup'!$A:$F,6,FALSE),\"\")","v":""},{"$f":"IFERROR(E152/$E$159,\"\")","v":""},{"$f":"IFERROR(F152/D152,\"\")","v":""},{"$f":"IFERROR((J152-L152)/J152,\"\")","v":""},{"$f":"IFERROR(D152/E152,\"\")","v":""},{"$f":"IFERROR(E152/$F$3,\"\")","v":""},{"$f":"IFERROR(J152*H152,\"\")","v":""}]
["Proposed",null,{"$f":"IFERROR(IF(AND(I153>$I$160,G153>$G$160),\"Star\",IF(AND(I153>$I$160,G153<$G$160),\"Puzzle\",IF(AND(I153<$I$160,G153>$G$160),\"Plow Horse\",\"Dog\"))),\"\")","v":"Dog"},{"$f":"IFERROR(IF(J153=\"\",D152,E153*J153),D152)","v":""},{"$f":"IFERROR(IF(K153=\"\",E152,K153*$F$3),E152)","v":0},{"$f":"IFERROR(D153*H153,F152)","v":""},{"$f":"IFERROR(IF(E153=\"\",G152,E153/$E$160),G152)","v":""},{"$f":"IFERROR(IF(L153=\"\",H152,L153/J153),H152)","v":""},"",{"$f":"J152","v":""},{"$f":"K152","v":""},{"$f":"L152","v":""}]
[]
["Baseline",{"$f":"'Cat 3 Setup'!A58","v":0},{"$f":"IFERROR(IF(AND(I155>$I$159,G155>$G$159),\"Star\",IF(AND(I155>$I$159,G155<$G$159),\"Puzzle\",IF(AND(I155<$I$159,G155>$G$159),\"Plow Horse\",\"Dog\"))),\"\")","v":"Dog"},{"$f":"IFERROR(VLOOKUP(B155,'Cat 3 Setup'!$A:$F,4,FALSE),\"\")","v":""},{"$f":"IFERROR(VLOOKUP(B155,'Cat 3 Setup'!$A:$F,3,FALSE),\"\")","v":0},{"$f":"IFERROR(VLOOKUP(B155,'Cat 3 Setup'!$A:$F,6,FALSE),\"\")","v":""},{"$f":"IFERROR(E155/$E$159,\"\")","v":""},{"$f":"IFERROR(F155/D155,\"\")","v":""},{"$f":"IFERROR((J155-L155)/J155,\"\")","v":""},{"$f":"IFERROR(D155/E155,\"\")","v":""},{"$f":"IFERROR(E155/$F$3,\"\")","v":""},{"$f":"IFERROR(J155*H155,\"\")","v":""}]
["Proposed",null,{"$f":"IFERROR(IF(AND(I156>$I$160,G156>$G$160),\"Star\",IF(AND(I156>$I$160,G156<$G$160),\"Puzzle\",IF(AND(I156<$I$160,G156>$G$160),\"Plow Horse\",\"Dog\"))),\"\")","v":"Dog"},{"$f":"IFERROR(IF(J156=\"\",D155,E156*J156),D155)","v":""},{"$f":"IFERROR(IF(K156=\"\",E155,K156*$F$3),E155)","v":0},{"$f":"IFERROR(D156*H156,F155)","v":""},{"$f":"IFERROR(IF(E156=\"\",G155,E156/$E$160),G155)","v":""},{"$f":"IFERROR(IF(L156=\"\",H155,L156/J156),H155)","v":""},"",{"$f":"J155","v":""},{"$f":"K155","v":""},{"$f":"L155","v":""}]
[]
[null,null,null,null,null,null,null,null,null,null,"(Items/Cover)"]
["Baseline","Total",null,{"$f":"IFERROR(SUMIF($A$8:$A$156,\"Baseline\",D$8:D$156),\"\")","v":0},{"$f":"IFERROR(SUMIF($A$8:$A$156,\"Baseline\",E$8:E$156),\"\")","v":0},{"$f":"IFERROR(SUMIF($A$8:$A$156,\"Baseline\",F$8:F$156),\"\")","v":0},{"$f":"IFERROR((AVERAGEIFS(G$8:G$156,$A$8:$A$156,\"Baseline\",G$8:G$156,\">0\")),\"\")","v":""},{"$f":"IFERROR(F159/D159,\"\")","v":""},{"$f":"IFERROR(AVERAGEIF($A$8:$A$156,\"Baseline\",I$8:I$156),\"\")","v":""},{"$f":"IFERROR(D159/E159,\"\")","v":""},{"$f":"IFERROR(E159/$F$3,\"\")","v":""},{"$f":"IFERROR(F159/E159,\"\")","v":""}]
["Proposed",null,null,{"$f":"IFERROR(SUMIF($A$8:$A$156,\"Proposed\",D$8:D$156),\"\")","v":0},{"$f":"IFERROR(SUMIF($A$8:$A$156,\"Proposed\",E$8:E$156),\"\")","v":0},{"$f":"IFERROR(SUMIF($A$8:$A$156,\"Proposed\",F$8:F$156),\"\")","v":0},{"$f":"IFERROR((AVERAGEIFS(G$8:G$156,$A$8:$A$156,\"Proposed\",G$8:G$156,\">0\")),\"\")","v":""},{"$f":"IFERROR(F160/D160,\"\")","v":""},{"$f":"IFERROR(AVERAGEIF($A$8:$A$156,\"Proposed\",I$8:I$156),\"\")","v":""},{"$f":"IFERROR(D160/E160,\"\")","v":""},{"$f":"IFERROR(E160/$F$3,\"\")","v":""},{"$f":"IFERROR(F160/E160,\"\")","v":""}]
[null,"%/BPs change",null,{"$f":"IFERROR((D160-D159)/D159,\"\")","v":""},{"$f":"IFERROR((E160-E159)/E159,\"\")","v":""},"",{"$f":"(G160-G159)*100","v":{"$error":"#VALUE!"}},{"$f":"(H160-H159)*100","v":{"$error":"#VALUE!"}},"","","",""]
[]
[]
[null,"Assumptions/Exclusions:"]
[]
[]
[]
[]
[]
[]
[null,"Admin Use:"]
[null,"CM (min):",{"$f":"ROUND(MIN(I8:I157),0)-5","v":-5},"Demand (max):",{"$f":"MIN(G8:G157)-0.05","v":-0.05}]
[null,"CM (max):",{"$f":"ROUND(MAX(I8:I157),0)+5","v":5},"Demand (min):",{"$f":"MAX(G8:G157)+0.05","v":0.05}]

{"sheet":"Cat 3 CM% Chart","index":16,"n_rows":46,"n_cols":7,"rows_kept":46,"cut":false,"hidden":false,"merged":[[44,3,44,4],[45,3,45,4]]}
[{"$f":"CONCATENATE('Cat 3 CM$'!C1,\" \",'Cat 3 CM$'!C5,\" \",'Cat 3 CM$'!C4,\" - \",'Cat 3 CM$'!F5)","v":"0 0 0 - 0"}]
["Menu Enginnering Graph by Contribution Margin Percentage"]
[]
[]
[]
[]
[]
[]
[]
[]
[]
[]
[]
[]
[]
[]
[]
[]
[]
[]
[]
[]
[]
[]
[]
[]
[]
[]
[]
[]
[]
[]
[]
[]
[]
[]
[]
[]
[]
[]
[]
[]
[]
[null,null,null,null,null,"Low","High"]
[null,null,"X-AXIS -->","Menu Mix Parameters:",null,{"$f":"IFERROR(IF('Cat 3 CM%'!D8=\"\",\"\",MIN('Cat 3 CM%'!G8:G157)*0.9),\"\")","v":""},{"$f":"IFERROR(IF('Cat 3 CM%'!D8=\"\",\"\",MAX('Cat 3 CM%'!G8:G157)*1.1),\"\")","v":""}]
[null,null,"Y-AXIS -->","Contribution Margin",null,{"$f":"IFERROR(IF('Cat 3 CM%'!D8=\"\",\"\",MIN('Cat 3 CM%'!$I$8:$I$157)*0.9),\"\")","v":""},{"$f":"IFERROR(IF('Cat 3 CM%'!D8=\"\",\"\",MAX('Cat 3 CM%'!$I$8:$I$157)*1.1),\"\")","v":""}]

{"sheet":"Costing-BP","index":17,"n_rows":111,"n_cols":4,"rows_kept":111,"cut":false,"hidden":true,"merged":[]}
["Appetizers-MC",null,null,"Cost"]
[3025078,"Fajita Chicken Nachos",null,2.68]
[3025079,"Jumbo Buffalo Wings",null,3.21]
[3025069,"Factory Soup of the Day",null,0.75]
[3025081,"Breaded Calamari",null,2.0499999999999998]
[3025077,"Stack of Rings",null,2.52]
[3025083,"Mango-Chicken Quesadilla",null,2.4]
[3025080,"Louisianna Crab Cakes",null,3.71]
[3025085,"Pub Fry Sampler",null,1.88]
[3025072,"Seared Ahi",null,3.7]
[3025071,"Cesar Salad",null,1.1499999999999999]
[3025070,"Italian Salad",null,3.25]
[3025082,"Spinach and Crab Egg Rolls",null,2.75]
[3025075,"Spinach Salad***",null,2.31]
[3025114,"Side of Pub Fries",null,0.5]
[3025074,"Steak Fajita Salad",null,3.36]
[3025084,"Ancho Chili Shrimp***",null,2.58]
[3025176,"Side Salad",null,0.75]
[3025076,"Shanghai Chicken Salad",null,2.67]
[3025073,"Side of Sweet Fries",null,0.63]
[3025146,"Side of Bread"]
[3025174,"Mozz Sticks"]
[3025175,"Chicken"]
[3025132,"Football Spec Crab Cakes"]
[3025159,"Football Spec Mini Calazone"]
[3025137,"Football Spec Quesadilla"]
[3025130,"Football Special Ancho Shrimp"]
[3025138,"Football Spec Wings"]
[3025136,"Football Spec O Rings"]
[3025135,"Football Spec Nachos"]
[3025127,"V-8 Juice Pub"]
[3025131,"Football Spec Calamari"]
[3025134,"Football Spec Fry Sampler"]
[3025125,"Grapefruit Juice Pub"]
[3025133,"Football Spec Egg Rolls"]
["Appetizers-MC Total"]
["Dessert-MC"]
[3025117,"Oven Baked Cookie",null,2]
[3025119,"Sundae",null,3]
[3025116,"Smores Tableside",null,2]
[3025118,"Kentucky Bourbon Bread Pudding",null,2]
["Dessert-MC Total"]
["Entrees-MC"]
[3025086,"The Pub Burger",null,2.75]
[3025095,"Caliente Chicken Burger",null,3.37]
[3025088,"Little Boy Blue Burger",null,2.95]
[3025168,"Mini Pub Burgers",null,2.75]
[3025099,"Be the Burgermeister"]
[3025097,"Kobe Burger***",null,3.08]
[3025087,"Wild Mushroom Burger",null,3.39]
[3025101,"Tap Leak Fish and Chips",null,3.54]
[3025107,"Margherita Flat Bread",null,3.44]
[3025090,"Hangover Cure Burger",null,2.81]
[3025110,"BBQ Chicken Flat Bread",null,1.7]
[3025113,"The Pub Flatbread of the day",null,3]
[3025091,"Vampire slayers Burger",null,2.76]
[3025103,"Bone in Ribeye",null,7.87]
[3025102,"Fish Tacos",null,2.75]
[3025096,"Salmon Burger",null,3.24]
[3025112,"Sauteed Chicken and Asparagus Flat Bread",null,2.71]
[3025169,"Fried Chicken Sliders",null,3]
[3025092,"Italian Burger",null,3.06]
[3025111,"Organic Baby Meat Balls Flat Bread",null,1.99]
[3025154,"Celebrity $150.00"]
[3025089,"Napa Burger",null,3.53]
[3025115,"Short Rib",null,2.61]
[3025104,"Salmon Wrapped Salmon",null,4.59]
[3025109,"Napolitano Flat Bread",null,4.05]
[3025106,"Spicy Southern Fried Chicken",null,3.4]
[3025094,"Meatless Burger",null,2.16]
[3025170,"Stuffed Meatball Sliders",null,3]
[3025171,"Ahi Tuna Sliders",null,3.25]
[3025100,"Wild Boar Pasta",null,1.1100000000000001]
[3025145,"Plain Burger",null,{"$f":"0.13+1.49","v":1.62}]
[3025172,"Steak Sliders",null,3.5]
[3025105,"Sweet Chili glazed Chicken",null,3.78]
[3025108,"Rustico Flat Bread",null,4.1100000000000003]
[3025098,"Lox en Burger",null,4.25]
[3025093,"Slip Sliding Sliders",null,2.84]
[3025152,"VIP $100.00"]
[3025173,"Outback Bowl Buffet"]
[3023053,"BP-Spec.Smoking Hot Chicken Sandwich"]
["Entrees-MC Total"]
["Modifiers"]
[-2268,"$1.00Bacon"]
[-3055,"Swiss"]
[-2271,"$3.50Chx Breast"]
[-3331,"Blue Chez"]
[-2277,"$1Mushroom"]
[-3057,"Jalapenos"]
[-6921,"$1. Gauc"]
[-2272,"$1Grilled Onion"]
[-2270,"$1.25Cheddar"]
[-2267,"$1.25American"]
[-6955,"Jalapenos$1.50"]
[-2201,"$.50 Onions"]
[-6920,"$1. Sour Crm"]
[-2286,"$1.25Swiss Ch"]
[-2282,"$1PZ Pepperoni"]
[-2276,"$1Mozzarella"]
[-2280,"$1PZ Chicken"]
[-2287,"$1Tomato"]
[-2200,"$1Ham"]
[-2269,"$1.25Bl Cheese"]
[-2283,"$1PZ Sausage"]
[-2279,"$1Pickles"]
[-2284,"$1PZ Wld Mushroo"]
[-2281,"$1PZ Onion"]
[-2285,"$1PZ Xtra Cheese"]
[-3151,"$1PZ Blk Olives"]
[-6871,"$2. Munster"]

{"sheet":"Costing-Cafe","index":18,"n_rows":250,"n_cols":4,"rows_kept":250,"cut":false,"hidden":true,"merged":[]}
["Appetizers-MC",null,null,"Cost"]
[3004001,"Chicken Quesadilla",null,1.58]
[3004002,"Chicken Tenders",null,1.56]
[3004016,"WP Tempura Zucchini",null,1]
[3000041,"Cafe Wings",null,1.82]
[3004011,"Spin Artich Dip",null,2.13]
[3004024,"WP Seared Filet Mignon",null,2.5]
[3004021,"WP Ponzu Scallops",null,2]
[3004006,"Shrimp Cocktail",null,0.92]
[3004012,"Texican Egg Rolls",null,1.65]
[3004020,"WP Pan Seared Crab Cake",null,1.75]
[3004010,"Additional Side"]
[3004019,"WP Grilled Baquette",null,1.5]
[3004018,"WP Sherry Mushrooms",null,1]
[3004023,"WP Sauteed Mussels",null,1.5]
[3004017,"WP Garlic Chili Fries",null,1.25]
[3004025,"WP Fresh Steamed Bao Bun",null,1]
[3004022,"WP Rosemary and Garlic Olives",null,1.65]
[3012004,"Bucket of Wings/Bucket of Beer"]
["Appetizers-MC Total"]
["Baked Goods-MC"]
[3001007,"Muffin"]
[3001014,"Croissant"]
[3001019,"Danish"]
["Baked Goods-MC Total"]
["Bkfst Sides-MC"]
[3001015,"Toast"]
[3001012,"Side Bacon"]
[3001010,"Oatmeal"]
[3009007,"Two Eggs"]
[3001018,"S/Sausage"]
[3001025,"Bagel and Cream Cheese"]
[3001005,"Side Hash Browns"]
[3009010,"One Egg Cafe"]
[3001009,"Cinnamon Roll"]
[3001017,"Fruit Yogurt"]
[3001006,"Biscuits and Gravy - Side"]
[3001016,"Cottage Cheese"]
[3001013,"S/Canadian Bacon"]
[3009016,"Side Ham Steak"]
[3009015,"Three Eggs Cafe"]
[3001026,"S/LOX"]
["Bkfst Sides-MC Total"]
["Bnq Breakfast-MC"]
[3001021,"Cornbeef Hash and Eggs",null,1.17]
["Bnq Breakfast-MC Total"]
["Breakfast-MC"]
[3000002,"Eggs Benedict",null,2.85]
[3000029,"California Garden",null,1.24]
[3000005,"Filet Benedict",null,3.38]
[3000023,"French Toast",null,0.81]
[3000007,"Bagel Breakfast Sandwich",null,1.59]
[3001059,"Ultimate Oatmeal",null,1.6]
[3000020,"Belgian Waffle",null,0.93]
[3000018,"Buttermilk Pancakes",null,0.45]
[3000022,"Strawberry Waffle",null,1.67]
[3000004,"Biscuits & Gravy",null,1.1100000000000001]
[3000021,"Blueberry Pancakes",null,1.9]
[3008023,"Omelets - Cafe"]
[3000001,"Continental Breakfast",null,1.28]
[3001011,"Cold Cereal"]
[3001002,"Yogurt and Granola"]
[3000068,"Mandarin Crepes",null,3.29]
[3027010,"Pancake- Short Stack"]
[3000066,"Carrot Cake Pancakes",null,2.5]
[3027012,"Pancake- One Cafe"]
[3000030,"Banana Split Waffle",null,1.37]
[3000067,"Dutch Baby Pancakes",null,0.79]
[3027011,"Short- Blue"]
[3000080,"Creme Brulee French Toast"]
[3000083,"CYO Frittata"]
[3000079,"Salmon Packages"]
[3000082,"Zucchini Fritters"]
[3008011,"Smoked Salmon Benedict"]
[3000081,"Berry Pizza"]
[3000084,"Smoked Duck Sandwich"]
[3000085,"BBQ Short Ribs"]
[3000086,"Peaches & Cream"]
["Breakfast-MC Total"]
["Dessert-MC"]
[3007017,"Apple Pie",null,1.25]
[3007018,"Hat Sundae",null,1.25]
[3001066,"Chocolate Lovers Cake",null,1.25]
[3007006,"Hot Brownie Delight",null,1.25]
[3001065,"Chocolate Turtle Tower",null,1.25]
[3001063,"Strawberrry Ice Cream Cake",null,1.25]
[3001067,"Trio Dessert Sampler",null,1.25]
[3001064,"Pecan Seduction Tart",null,1.25]
[3001062,"Key Lime-tini",null,1.25]
[3001069,"Rocky Road Ice Cream Cake",null,1.25]
[3023513,"Ice Cream"]
[3023518,"Ala Mode"]
["Dessert-MC Total"]
["Eggs-MC"]
[3000010,"Eggs any Style"]
[3000011,"Ham & Cheese Omelet",null,1.62]
[3000008,"The Complete Monte",null,2.75]
[3000077,"Graveyard Special",null,2]
[3000009,"Ham & Eggs",null,1.79]
[3000016,"Mushroomswiss Omelet",null,0.95]
[3000019,"Coupon Breakfast"]
[3000015,"Southern Fried Steak & Eggs",null,1.8]
[3000028,"Huevos Rancheros",null,2.4900000000000002]
[3000012,"Vito Omelet",null,1.5]
[3000014,"Sirloin Steak & Eggs",null,4.3]
[3000024,"Eggs No Meat"]
["Eggs-MC Total"]
["Entrees-MC"]
[3000051,"Rib-Eye Steak",null,5.2]
[3000043,"Grilled Pacific Salmon",null,5.18]
[3005002,"Fish and Chips",null,2.19]
[3000047,"Chicken Alfredo",null,1.07]
[3000048,"Surf-N-Turf",null,4.82]
[3005009,"Rice Bowl",null,0.86]
[3000053,"Tuscan Chicken Breast",null,3.29]
[3005005,"Meatloaf",null,1.54]
[3000049,"Filet",null,8.2799999999999994]
[3005003,"Fried Chicken - CAF",null,3.5]
[3000052,"NY Strip Steak",null,6.13]
[3000078,"Graveyard Steak Dinner",null,2]
[3000073,"Mixed Up Lasagne",null,2]
[3000072,"Country Pot Pie",null,3.07]
[3000076,"Roasted Sicilian Grouper",null,10.050000000000001]
[3000074,"Mediterranean Angel Hair",null,1.08]
[3000075,"Country Mixed Grill",null,3.07]
[3005030,"CAF-SPEC Blackened Snapper"]
[3005029,"CAF-SPEC Pot Roast"]
[3005028,"CAF-SPEC Huli Huli Chicken"]
[3005021,"M/C du jour Special"]
["Entrees-MC Total"]
["Fruits-MC"]
[3001004,"Seasonal Fruit Cup",null,1]
[3000003,"Fresh Fruit Carousel",null,2.75]
[3001003,"Grapefruit Segments Fresh",null,1]
[3016026,"Berries Side",null,2]
[3016030,"Banana Side Cafe",null,0.5]
[3001001,"Sliced Half Cantelope",null,2.2000000000000002]
[3016029,"Fruit Side Cafe",null,1]
[3001022,"Berry Cup",null,1]
[3001020,"Sliced Half Honeydew",null,2.2000000000000002]
["Fruits-MC Total"]
["Modifiers"]
[-2209,"$1Cheese"]
[-2246,"$1Bacon"]
[-2210,"$.50Onions"]
[-2277,"$1Mushroom"]
[-2253,"$.50Tomato"]
[-2251,"$.50Peppers"]
[-2200,"$1Ham"]
[-2252,"$.50Spinach"]
[-3331,"Blue Chez"]
[-2207,"$1Banana"]
[-2464,"$1Cheddar"]
[-2468,"$1Egg w/ ch"]
[-2201,"$.50 Onions"]
[-2211,"$2.50Avocado"]
[-2216,"$1Dressing"]
[-2208,"$1Berries"]
[-2466,"$1Swiss Cheese"]
[-2198,"$1Sausage"]
[-2360,"$.5Hash w/Onions"]
[-2275,"$.50Jalpeno"]
[-2248,"$1.50Avocado"]
[-2397,"$1Blueberry"]
[-2215,"$.50Sour Cream"]
[-2815,"$1 Mixed Fruit"]
[-5352,"$1Pepper Jack"]
[-2359,"$1Hash w/Cheese"]
[-2199,"$.50 peppers"]
[-2465,"$1Blue Cheese"]
[-2469,"$.50Egg w/ Onio"]
[-2322,"$1Fruit"]
[-2214,"$.50Salsa"]
[-2226,"$.50Brocolli"]
[-2467,"$1Provolone Chz"]
[-2219,"$.50Pickles"]
[-2222,"$.50Olives"]
[-5916,"$1 Broccoli"]
[-2247,"$.50Asparagus"]
[-2326,"TERI SHRIMP"]
[-2212,"$1Guacamole"]
[-5353,"$1Fetta"]
["Modifiers Total"]
["Platters-MC"]
[3000006,"Smoked Salmon Platter - MC CAF",null,7.17]
["Platters-MC Total"]
["Sandwich/Burg-MC"]
[3003009,"Clubhouse",null,2.06]
[3003002,"Cheeseburger",null,1.55]
[3003012,"Hot Turkey",null,1.77]
[3003008,"B.L.T.",null,2.0699999999999998]
[3003019,"Cafe Reuben",null,1.35]
[3011005,"Philly Cheese Steak",null,1.38]
[3000034,"Barbeque Burger",null,2.2599999999999998]
[3003011,"Deli Salad Sandwiches",null,2.0099999999999998]
[3003004,"Mushroom-Swiss Burger",null,1.74]
[3003007,"Half-Sandwich with Soup or Salad",null,3.5]
[3000036,"Blackened Chicken Sandwich",null,2.08]
[3000069,"Beef Eater",null,5.6]
[3000035,"Cafe Patty Melt",null,0.87]
[3000033,"Southwestern Burger",null,1.62]
[3003003,"Chicken Burger",null,2.04]
[3000070,"Crab Cake Slammer",null,4.07]
[3000071,"Buffalo Shrimp Wrap",null,2.0499999999999998]
[3000054,"CAFE Grill Cheese",null,1]
[3003015,"Grilled Ham & Cheese",null,1.5]
["Sandwich/Burg-MC Total"]
["Side/Ala Cart-MC"]
[3006003,"Fries"]
[3023506,"Salsa"]
[3006008,"Slaw"]
[3006009,"Side Tomato"]
[3006017,"Country Gravy"]
[3006016,"Brown Gravy"]
[3006012,"Side Meat"]
[3006013,"S/8oz Chicken"]
[3006020,"BBQ Sauce"]
[3006019,"Sauce"]
[3008030,"Corned Beef Hash"]
[3006001,"Baked Potato"]
[3006015,"Shrimp"]
[3006007,"Onion Ring"]
[3006004,"Mashed Potato"]
[3006006,"Rice"]
[3006010,"Veggies"]
[3006026,"Hollandaise"]
[3006022,"Tartar Sauce"]
[3023509,"Chips"]
[3006014,"Burger Patty"]
[3001027,"S/8oz NY STEAK"]
[3006018,"Turkey Gravy"]
[3006011,"Plain Pasta"]
[3006002,"Corn on the Cob"]
["Side/Ala Cart-MC Total"]
["Soups/Salads-MC"]
[3010029,"Salad with Entree - Cafe",null,0.75]
[3010007,"Soup with Entree",null,0.5]
[3010024,"Cobb Salad -Cafe",null,1.97]
[3010003,"Chicken Noodle - Cup",null,0.5]
[3010010,"Caf¿ Salad",null,1.1299999999999999]
[3010004,"Chicken Noodle - Bowl",null,0.75]
[3010001,"Soup of the Day - Cup",null,0.5]
[3010025,"Chicken Caesar Salad -Cafe",null,1.1299999999999999]
[3010026,"Baja Chicken Salad- cafe",null,1.19]
[3000032,"Wild Berry Salad",null,2.25]
[3010002,"Soup of the Day - Bowl",null,0.75]
[3010030,"Seared Steak Salad",null,2.4700000000000002]
[3010032,"Sizzling Shrimp Salad",null,3.17]
[3010031,"Marinated Beet Salad",null,2.31]
["Soups/Salads-MC Total"]

{"sheet":"Insights_Actions","index":19,"n_rows":10,"n_cols":7,"rows_kept":10,"cut":false,"hidden":true,"merged":[[1,0,2,0],[1,1,2,1],[1,2,1,6],[4,0,5,0],[4,1,5,1],[4,2,5,2],[4,3,5,3],[4,5,5,5],[4,6,5,6],[8,4,9,4],[8,5,9,5],[8,6,9,6],[6,0,7,0],[6,1,7,1],[6,2,7,2],[6,4,7,4],[6,5,7,5],[6,6,7,6],[8,0,9,0],[8,1,9,1],[8,2,9,2]]}
[]
["Quadrant","Insights","Actions"]
[null,null,"Alter Sales Strategy","Decrease Cost","Alter Menu","Alter Price","Other"]
["Star","Item has high profitability and high volume","Maintain quality specs",null,"Feature prominently on menu","Increase price ","Do Nothing"]
["Puzzle","Item has high profitability and low volume","Offer as special",null,"Rename item","Decrease price","Remove from menu"]
[null,null,null,null,"Feature prominently on menu"]
["Plow horse","Item has low profitability and high volume","Avoid offering as special","Reduce portion sizes","Move to less prominent place on menu","Increase price"]
[null,null,null,"Find alternate ingredients"]
["Dog","Item has low profitability and low volume",null,"Reduce portion sizes",null,null,"Remove from menu"]
[null,null,null,"Find alternate ingredients"]

{"sheet":"Sheet5","index":20,"n_rows":0,"n_cols":0,"rows_kept":0,"cut":false,"hidden":true,"merged":[]}