{"text_format":"1","workbook":"xlsx","n_sheets":21,"sheets":["Instructions","Menu Item Change Log","Cat 1 Setup (example to overide","Cat 1 CM$","Cat 1 CM$ Chart","Cat 1 CM%","Cat 1 CM% Chart","Cat 2 Setup","Cat 2 CM$","Cat 2 CM$ Chart","Cat 2 CM%","Cat 2 CM% Chart","Cat 3 Setup","Cat 3 CM$","Cat 3 CM$ Chart","Cat 3 CM%","Cat 3 CM% Chart","Costing-BP","Costing-Cafe","Insights_Actions","Sheet5"],"not_rendered":{"charts":6,"images":3,"macros":1,"external_links":0,"defined_names":6,"comments":0,"pivot_tables":0},"unopened":[],"bounds":{"document_bytes":16777216,"sheet_cells":100000,"rows_first":2000,"rows_last":500,"rows_between":2000,"halvings":0,"cell_chars":16384,"cell_head_chars":4096},"cells_cut":0,"cells_raw":0,"read":"whole","date_system":"1900"}

{"sheet":"Instructions","index":0,"n_rows":0,"n_cols":0,"rows_kept":0,"cut":false,"hidden":false,"merged":[[1,4,1,10]]}

{"sheet":"Menu Item Change Log","index":1,"n_rows":38,"n_cols":14,"rows_kept":38,"cut":false,"hidden":false,"merged":[[36,11,36,13],[37,11,37,13],[36,6,36,8],[37,6,37,8],[26,10,26,13],[30,11,30,13],[31,11,31,13],[32,11,32,13],[33,11,33,13],[34,11,34,13],[35,11,35,13],[37,1,37,3],[26,5,26,8],[30,6,30,8],[31,6,31,8],[32,6,32,8],[33,6,33,8],[34,6,34,8],[35,6,35,8],[26,0,26,3],[30,1,30,3],[36,1,36,3],[35,1,35,3],[31,1,31,3],[32,1,32,3],[33,1,33,3],[34,1,34,3],[24,11,24,13],[9,11,9,13],[10,11,10,13],[11,11,11,13],[13,10,13,13],[17,11,17,13],[18,11,18,13],[19,11,19,13],[20,11,20,13],[21,11,21,13],[22,11,22,13],[23,11,23,13],[0,10,0,13],[4,11,4,13],[5,11,5,13],[6,11,6,13],[7,11,7,13],[8,11,8,13],[21,1,21,3],[22,1,22,3],[23,1,23,3],[24,1,24,3],[21,6,21,8],[22,6,22,8],[23,6,23,8],[24,6,24,8],[20,1,20,3],[13,5,13,8],[9,1,9,3],[10,1,10,3],[11,1,11,3],[11,6,11,8],[13,0,13,3],[19,1,19,3],[20,6,20,8],[7,6,7,8],[8,6,8,8],[9,6,9,8],[10,6,10,8],[17,6,17,8],[18,6,18,8],[19,6,19,8],[7,1,7,3],[8,1,8,3],[5,1,5,3],[17,1,17,3],[18,1,18,3],[0,5,0,8],[4,6,4,8],[5,6,5,8],[6,6,6,8],[0,0,0,3],[4,1,4,3],[6,1,6,3]]}
["Menu Item Change Log -Example",null,null,null,null,"Menu Item Change Log ",null,null,null,null,"Menu Item Change Log "]
["Outlet ","Revenue Center ","Meal Period ","Date of change ",null,"Outlet ","Revenue Center ","Meal Period ","Date of change ",null,"Outlet ","Revenue Center ","Meal Period ","Date of change "]
["PB&G","PB&G","All-Day","2023-03-26"]
[]
["Item Name: ","TUNA POKE",null,null,null,"Item Name: ",null,null,null,null,"Item Name: "]
["Current Quadarant: ","Star",null,null,null,"Current Quadarant:",null,null,null,null,"Current Quadarant:"]
["Description of change:","Change marination and accoutrement, change tuna spec for larger Saku loin",null,null,null,"Description of change: ",null,null,null,null,"Description of change: "]
["Reason for change: ","Move to a lighter soy & sesame flavor, Tuna spec change drops cost",null,null,null,"Reason for change:",null,null,null,null,"Reason for change:"]
{"$rows_left_out":31}
{"sheet":"Cat 1 Setup (example to overide","index":2,"n_rows":59,"n_cols":16,"rows_kept":59,"cut":false,"hidden":false,"merged":[[5,0,6,5],[3,14,4,15]]}
[null,null,null,null,null,null,null,null,null,null,"Restaurant Outlet Name","Blue Café","Check Count",600]
[null,null,null,null,null,null,null,null,null,null,"Meal Period","Dinner","Cover Count",1688]
[null,null,null,null,null,null,null,null,null,null,"Revenue Center","Dining Room","Average Check",48.09]
[null,null,null,null,null,null,null,null,null,null,"Menu Category","Entrée","Currency",{"$f":"IFERROR(IF(LEFT(N9,(FIND(MID(N9,MIN(IF(ISNUMBER(1*MID(N9,ROW($1:$254),1)),ROW($1:$254))),1),N9)-1))=\"\",\"$\",LEFT(N9,(FIND(MID(N9,MIN(IF(ISNUMBER(1*MID(N9,ROW($1:$254),1)),ROW($1:$254))),1),N9)-1))),\"\")","v":"$"}]
[null,null,null,null,null,null,null,null,null,null,"Start Date","2023-11-01","End Date","2023-01-31"]
[]
[]
["Item Name","Item Number","Qty Sold","Gross Sales","Avg. Item Cost","COGS $",null,null,null,null,"Item Name","Item Number","Qty Sold","Gross Sales","Avg. Item Cost","COGS $"]
{"$rows_left_out":52}
{"sheet":"Cat 1 CM$","index":3,"n_rows":173,"n_cols":12,"rows_kept":173,"cut":false,"hidden":false,"merged":[[34,1,35,1],[37,1,38,1],[40,1,41,1],[171,3,171,4],[172,3,172,4],[67,1,68,1],[49,1,50,1],[52,1,53,1],[55,1,56,1],[58,1,59,1],[61,1,62,1],[148,1,149,1],[151,1,152,1],[91,1,92,1],[94,1,95,1],[158,1,159,2],[160,1,160,2],[118,1,119,1],[115,1,116,1],[112,1,113,1],[121,1,122,1],[124,1,125,1],[127,1,128,1],[130,1,131,1],[133,1,134,1],[136,1,137,1],[139,1,140,1],[142,1,143,1],[145,1,146,1],[106,1,107,1],[109,1,110,1],[154,1,155,1],[82,1,83,1],[85,1,86,1],[88,1,89,1],[97,1,98,1],[100,1,101,1],[103,1,104,1],[79,1,80,1],[7,1,8,1],[10,1,11,1],[70,1,71,1],[73,1,74,1],[76,1,77,1],[13,1,14,1],[16,1,17,1],[19,1,20,1],[22,1,23,1],[25,1,26,1],[43,1,44,1],[46,1,47,1],[64,1,65,1],[28,1,29,1],[31,1,32,1]]}
[null,"Restaurant Name",{"$f":"'Cat 1 Setup (example to overide'!L1","v":"Blue Café"}]
[null,"Start Date:",{"$f":"'Cat 1 Setup (example to overide'!L5","v":"2023-11-01"},null,"Check Count:",{"$f":"'Cat 1 Setup (example to overide'!N1","v":600}]
[null,"End Date",{"$f":"'Cat 1 Setup (example to overide'!N5","v":"2023-01-31"},null,"Cover Count:",{"$f":"'Cat 1 Setup (example to overide'!N2","v":1688}]
[null,"Meal Period:",{"$f":"'Cat 1 Setup (example to overide'!L2","v":"Dinner"},null,"Average Check:",{"$f":"'Cat 1 Setup (example to overide'!N3","v":48.09}]
[null,"Revenue Center:",{"$f":"'Cat 1 Setup (example to overide'!L3","v":"Dining Room"},null,"Menu Category",{"$f":"'Cat 1 Setup (example to overide'!L4","v":"Entrée"}]
[]
[null,"Item Name","Quadrant","Item Sales","Qty Sold","Food Cost","Menu Mix %","Item Cost %","Contribution Margin $","Item Price","Item/Cover%","Item Cost"]
["Baseline",{"$f":"'Cat 1 Setup (example to overide'!A9","v":"SALMON"},{"$f":"IFERROR(IF(AND(I8>$I$159,G8>$G$159),\"Star\",IF(AND(I8>$I$159,G8<$G$159),\"Puzzle\",IF(AND(I8<$I$159,G8>$G$159),\"Plow Horse\",\"Dog\"))),\"\")","v":"Star"},{"$f":"IFERROR(VLOOKUP(B8,'Cat 1 Setup (example to overide'!$A:$F,4,FALSE),\"\")","v":25948},{"$f":"IFERROR(VLOOKUP(B8,'Cat 1 Setup (example to overide'!$A:$F,3,FALSE),\"\")","v":998},{"$f":"IFERROR(VLOOKUP(B8,'Cat 1 Setup (example to overide'!$A:$F,6,FALSE),\"\")","v":5349.28},{"$f":"IFERROR(E8/$E$159,\"\")","v":9.3682530742513842E-2},{"$f":"IFERROR(F8/D8,\"\")","v":0.20615384615384613},{"$f":"IFERROR(J8-L8,\"\")","v":20.64},{"$f":"IFERROR(D8/E8,\"\")","v":26},{"$f":"IFERROR(E8/$F$3,\"\")","v":0.59123222748815163},{"$f":"IFERROR(J8*H8,\"\")","v":5.3599999999999994}]
{"$rows_left_out":166}
{"sheet":"Cat 1 CM$ Chart","index":4,"n_rows":46,"n_cols":7,"rows_kept":46,"cut":false,"hidden":false,"merged":[[44,3,44,4],[45,3,45,4]]}
[{"$f":"CONCATENATE('Cat 1 CM$'!C1,\" \",'Cat 1 CM$'!C5,\" \",'Cat 1 CM$'!C4,\" - \",'Cat 1 CM$'!F5)","v":"Blue Café Dining Room Dinner - Entrée"}]
["Menu Enginnering Graph by Contribution Margin Dollars"]
[]
[]
[]
[]
[]
[]
{"$rows_left_out":39}
{"sheet":"Cat 1 CM%","index":5,"n_rows":173,"n_cols":12,"rows_kept":173,"cut":false,"hidden":false,"merged":[[171,3,171,4],[172,3,172,4],[58,1,59,1],[25,1,26,1],[28,1,29,1],[31,1,32,1],[34,1,35,1],[37,1,38,1],[40,1,41,1],[112,1,113,1],[79,1,80,1],[82,1,83,1],[85,1,86,1],[88,1,89,1],[91,1,92,1],[94,1,95,1],[22,1,23,1],[7,1,8,1],[10,1,11,1],[13,1,14,1],[16,1,17,1],[19,1,20,1],[106,1,107,1],[109,1,110,1],[97,1,98,1],[100,1,101,1],[103,1,104,1],[76,1,77,1],[43,1,44,1],[46,1,47,1],[49,1,50,1],[52,1,53,1],[55,1,56,1],[61,1,62,1],[64,1,65,1],[67,1,68,1],[70,1,71,1],[73,1,74,1],[115,1,116,1],[118,1,119,1],[158,1,159,2],[160,1,160,2],[121,1,122,1],[124,1,125,1],[127,1,128,1],[130,1,131,1],[133,1,134,1],[136,1,137,1],[139,1,140,1],[142,1,143,1],[145,1,146,1],[148,1,149,1],[151,1,152,1],[154,1,155,1]]}
[null,"Restaurant Name",{"$f":"'Cat 1 Setup (example to overide'!L1","v":"Blue Café"}]
[null,"Start Date:",{"$f":"'Cat 1 Setup (example to overide'!L5","v":"2023-11-01"},null,"Check Count:",{"$f":"'Cat 1 Setup (example to overide'!N1","v":600}]
[null,"End Date",{"$f":"'Cat 1 Setup (example to overide'!N5","v":"2023-01-31"},null,"Cover Count:",{"$f":"'Cat 1 Setup (example to overide'!N2","v":1688}]
[null,"Meal Period:",{"$f":"'Cat 1 Setup (example to overide'!L2","v":"Dinner"},null,"Average Check:",{"$f":"'Cat 1 Setup (example to overide'!N3","v":48.09}]
[null,"Revenue Center:",{"$f":"'Cat 1 Setup (example to overide'!L3","v":"Dining Room"},null,"Menu Category",{"$f":"'Cat 1 Setup (example to overide'!L4","v":"Entrée"}]
[]
[null,"Item Name","Quadrant","Item Sales","Qty Sold","Food Cost","Menu Mix %","Item Cost %","Contribution Margin %","Item Price","Item/Cover%","Item Cost"]
["Baseline",{"$f":"'Cat 1 Setup (example to overide'!A9","v":"SALMON"},{"$f":"IFERROR(IF(AND(I8>$I$159,G8>$G$159),\"Star\",IF(AND(I8>$I$159,G8<$G$159),\"Puzzle\",IF(AND(I8<$I$159,G8>$G$159),\"Plow Horse\",\"Dog\"))),\"\")","v":"Star"},{"$f":"IFERROR(VLOOKUP(B8,'Cat 1 Setup (example to overide'!$A:$F,4,FALSE),\"\")","v":25948},{"$f":"IFERROR(VLOOKUP(B8,'Cat 1 Setup (example to overide'!$A:$F,3,FALSE),\"\")","v":998},{"$f":"IFERROR(VLOOKUP(B8,'Cat 1 Setup (example to overide'!$A:$F,6,FALSE),\"\")","v":5349.28},{"$f":"IFERROR(E8/$E$159,\"\")","v":9.3682530742513842E-2},{"$f":"IFERROR(F8/D8,\"\")","v":0.20615384615384613},{"$f":"IFERROR((J8-L8)/J8,\"\")","v":0.79384615384615387},{"$f":"IFERROR(D8/E8,\"\")","v":26},{"$f":"IFERROR(E8/$F$3,\"\")","v":0.59123222748815163},{"$f":"IFERROR(J8*H8,\"\")","v":5.3599999999999994}]
{"$rows_left_out":166}
{"sheet":"Cat 1 CM% Chart","index":6,"n_rows":46,"n_cols":7,"rows_kept":46,"cut":false,"hidden":false,"merged":[[44,3,44,4],[45,3,45,4]]}
[{"$f":"CONCATENATE('Cat 1 CM$'!C1,\" \",'Cat 1 CM$'!C5,\" \",'Cat 1 CM$'!C4,\" - \",'Cat 1 CM$'!F5)","v":"Blue Café Dining Room Dinner - Entrée"}]
["Menu Enginnering Graph by Contribution Margin Percentage"]
[]
[]
[]
[]
[]
[]
{"$rows_left_out":39}
{"sheet":"Cat 2 Setup","index":7,"n_rows":60,"n_cols":16,"rows_kept":60,"cut":false,"hidden":false,"merged":[[3,14,4,15],[5,0,6,5]]}
[null,null,null,null,null,null,null,null,null,null,"Restaurant Outlet Name",null,"Check Count"]
[null,null,null,null,null,null,null,null,null,null,"Meal Period",null,"Cover Count"]
[null,null,null,null,null,null,null,null,null,null,"Revenue Center",null,"Average Check"]
[null,null,null,null,null,null,null,null,null,null,"Menu Category",null,"Currency",{"$f":"IFERROR(IF(LEFT(N9,(FIND(MID(N9,MIN(IF(ISNUMBER(1*MID(N9,ROW($1:$255),1)),ROW($1:$255))),1),N9)-1))=\"\",\"$\",LEFT(N9,(FIND(MID(N9,MIN(IF(ISNUMBER(1*MID(N9,ROW($1:$255),1)),ROW($1:$255))),1),N9)-1))),\"\")","v":""}]
[null,null,null,null,null,null,null,null,null,null,"Start Date",null,"End Date"]
[]
[]
["Item Name","Item Number","Qty Sold","Gross Sales","Avg. Item Cost","COGS $",null,null,null,null,"Item Name","Item Number","Qty Sold","Gross Sales","Avg. Item Cost","COGS $"]
{"$rows_left_out":53}
{"sheet":"Cat 2 CM$","index":8,"n_rows":173,"n_cols":12,"rows_kept":173,"cut":false,"hidden":false,"merged":[[172,3,172,4],[133,1,134,1],[136,1,137,1],[139,1,140,1],[142,1,143,1],[145,1,146,1],[148,1,149,1],[151,1,152,1],[154,1,155,1],[158,1,159,2],[160,1,160,2],[171,3,171,4],[130,1,131,1],[97,1,98,1],[100,1,101,1],[103,1,104,1],[106,1,107,1],[109,1,110,1],[112,1,113,1],[115,1,116,1],[118,1,119,1],[121,1,122,1],[124,1,125,1],[127,1,128,1],[94,1,95,1],[61,1,62,1],[64,1,65,1],[67,1,68,1],[70,1,71,1],[73,1,74,1],[76,1,77,1],[79,1,80,1],[82,1,83,1],[85,1,86,1],[88,1,89,1],[91,1,92,1],[58,1,59,1],[25,1,26,1],[28,1,29,1],[31,1,32,1],[34,1,35,1],[37,1,38,1],[40,1,41,1],[43,1,44,1],[46,1,47,1],[49,1,50,1],[52,1,53,1],[55,1,56,1],[22,1,23,1],[7,1,8,1],[10,1,11,1],[13,1,14,1],[16,1,17,1],[19,1,20,1]]}
[null,"Restaurant Name",{"$f":"'Cat 2 Setup'!L1","v":0}]
[null,"Start Date:",{"$f":"'Cat 2 Setup'!L5","v":"00:00:00"},null,"Check Count:",{"$f":"'Cat 2 Setup'!N1","v":0}]
[null,"End Date",{"$f":"'Cat 2 Setup'!N5","v":"00:00:00"},null,"Cover Count:",{"$f":"'Cat 2 Setup'!N2","v":0}]
[null,"Meal Period:",{"$f":"'Cat 2 Setup'!L2","v":0},null,"Average Check:",{"$f":"'Cat 2 Setup'!N3","v":0}]
[null,"Revenue Center:",{"$f":"'Cat 2 Setup'!L3","v":0},null,"Menu Category",{"$f":"'Cat 2 Setup'!L4","v":0}]
[]
[null,"Item Name","Quadrant","Item Sales","Qty Sold","Food Cost","Menu Mix %","Item Cost %","Contribution Margin $","Item Price","Item/Cover%","Item Cost"]
["Baseline",{"$f":"'Cat 2 Setup'!A9","v":0},{"$f":"IFERROR(IF(AND(I8>$I$159,G8>$G$159),\"Star\",IF(AND(I8>$I$159,G8<$G$159),\"Puzzle\",IF(AND(I8<$I$159,G8>$G$159),\"Plow Horse\",\"Dog\"))),\"\")","v":"Dog"},{"$f":"IFERROR(VLOOKUP(B8,'Cat 2 Setup'!$A:$F,4,FALSE),\"\")","v":""},{"$f":"IFERROR(VLOOKUP(B8,'Cat 2 Setup'!$A:$F,3,FALSE),\"\")","v":0},{"$f":"IFERROR(VLOOKUP(B8,'Cat 2 Setup'!$A:$F,6,FALSE),\"\")","v":""},{"$f":"IFERROR(E8/$E$159,\"\")","v":""},{"$f":"IFERROR(F8/D8,\"\")","v":""},{"$f":"IFERROR(J8-L8,\"\")","v":""},{"$f":"IFERROR(D8/E8,\"\")","v":""},{"$f":"IFERROR(E8/$F$3,\"\")","v":""},{"$f":"IFERROR(J8*H8,\"\")","v":""}]
{"$rows_left_out":166}
{"sheet":"Cat 2 CM$ Chart","index":9,"n_rows":46,"n_cols":7,"rows_kept":46,"cut":false,"hidden":false,"merged":[[44,3,44,4],[45,3,45,4]]}
[{"$f":"CONCATENATE('Cat 2 CM$'!C1,\" \",'Cat 2 CM$'!C5,\" \",'Cat 2 CM$'!C4,\" - \",'Cat 2 CM$'!F5)","v":"0 0 0 - 0"}]
["Menu Enginnering Graph by Contribution Margin Dollars"]
[]
[]
[]
[]
[]
[]
{"$rows_left_out":39}
{"sheet":"Cat 2 CM%","index":10,"n_rows":173,"n_cols":12,"rows_kept":173,"cut":false,"hidden":false,"merged":[[172,3,172,4],[133,1,134,1],[136,1,137,1],[139,1,140,1],[142,1,143,1],[145,1,146,1],[148,1,149,1],[151,1,152,1],[154,1,155,1],[158,1,159,2],[160,1,160,2],[171,3,171,4],[130,1,131,1],[97,1,98,1],[100,1,101,1],[103,1,104,1],[106,1,107,1],[109,1,110,1],[112,1,113,1],[115,1,116,1],[118,1,119,1],[121,1,122,1],[124,1,125,1],[127,1,128,1],[94,1,95,1],[61,1,62,1],[64,1,65,1],[67,1,68,1],[70,1,71,1],[73,1,74,1],[76,1,77,1],[79,1,80,1],[82,1,83,1],[85,1,86,1],[88,1,89,1],[91,1,92,1],[58,1,59,1],[25,1,26,1],[28,1,29,1],[31,1,32,1],[34,1,35,1],[37,1,38,1],[40,1,41,1],[43,1,44,1],[46,1,47,1],[49,1,50,1],[52,1,53,1],[55,1,56,1],[22,1,23,1],[7,1,8,1],[10,1,11,1],[13,1,14,1],[16,1,17,1],[19,1,20,1]]}
[null,"Restaurant Name",{"$f":"'Cat 2 Setup'!L1","v":0}]
[null,"Start Date:",{"$f":"'Cat 2 Setup'!L5","v":"00:00:00"},null,"Check Count:",{"$f":"'Cat 2 Setup'!N1","v":0}]
[null,"End Date",{"$f":"'Cat 2 Setup'!N5","v":"00:00:00"},null,"Cover Count:",{"$f":"'Cat 2 Setup'!N2","v":0}]
[null,"Meal Period:",{"$f":"'Cat 2 Setup'!L2","v":0},null,"Average Check:",{"$f":"'Cat 2 Setup'!N3","v":0}]
[null,"Revenue Center:",{"$f":"'Cat 2 Setup'!L3","v":0},null,"Menu Category",{"$f":"'Cat 2 Setup'!L4","v":0}]
[]
[null,"Item Name","Quadrant","Item Sales","Qty Sold","Food Cost","Menu Mix %","Item Cost %","Contribution Margin %","Item Price","Item/Cover%","Item Cost"]
["Baseline",{"$f":"'Cat 2 Setup'!A9","v":0},{"$f":"IFERROR(IF(AND(I8>$I$159,G8>$G$159),\"Star\",IF(AND(I8>$I$159,G8<$G$159),\"Puzzle\",IF(AND(I8<$I$159,G8>$G$159),\"Plow Horse\",\"Dog\"))),\"\")","v":"Dog"},{"$f":"IFERROR(VLOOKUP(B8,'Cat 2 Setup'!$A:$F,4,FALSE),\"\")","v":""},{"$f":"IFERROR(VLOOKUP(B8,'Cat 2 Setup'!$A:$F,3,FALSE),\"\")","v":0},{"$f":"IFERROR(VLOOKUP(B8,'Cat 2 Setup'!$A:$F,6,FALSE),\"\")","v":""},{"$f":"IFERROR(E8/$E$159,\"\")","v":""},{"$f":"IFERROR(F8/D8,\"\")","v":""},{"$f":"IFERROR((J8-L8)/J8,\"\")","v":""},{"$f":"IFERROR(D8/E8,\"\")","v":""},{"$f":"IFERROR(E8/$F$3,\"\")","v":""},{"$f":"IFERROR(J8*H8,\"\")","v":""}]
{"$rows_left_out":166}
{"sheet":"Cat 2 CM% Chart","index":11,"n_rows":46,"n_cols":7,"rows_kept":46,"cut":false,"hidden":false,"merged":[[44,3,44,4],[45,3,45,4]]}
[{"$f":"CONCATENATE('Cat 2 CM$'!C1,\" \",'Cat 2 CM$'!C5,\" \",'Cat 2 CM$'!C4,\" - \",'Cat 2 CM$'!F5)","v":"0 0 0 - 0"}]
["Menu Enginnering Graph by Contribution Margin Percentage"]
[]
[]
[]
[]
[]
[]
{"$rows_left_out":39}
{"sheet":"Cat 3 Setup","index":12,"n_rows":60,"n_cols":16,"rows_kept":60,"cut":false,"hidden":false,"merged":[[3,14,4,15],[5,0,6,5]]}
[null,null,null,null,null,null,null,null,null,null,"Restaurant Outlet Name",null,"Check Count"]
[null,null,null,null,null,null,null,null,null,null,"Meal Period",null,"Cover Count"]
[null,null,null,null,null,null,null,null,null,null,"Revenue Center",null,"Average Check"]
[null,null,null,null,null,null,null,null,null,null,"Menu Category",null,"Currency",{"$f":"IFERROR(IF(LEFT(N9,(FIND(MID(N9,MIN(IF(ISNUMBER(1*MID(N9,ROW($1:$255),1)),ROW($1:$255))),1),N9)-1))=\"\",\"$\",LEFT(N9,(FIND(MID(N9,MIN(IF(ISNUMBER(1*MID(N9,ROW($1:$255),1)),ROW($1:$255))),1),N9)-1))),\"\")","v":""}]
[null,null,null,null,null,null,null,null,null,null,"Start Date",null,"End Date"]
[]
[]
["Item Name","Item Number","Qty Sold","Gross Sales","Avg. Item Cost","COGS $",null,null,null,null,"Item Name","Item Number","Qty Sold","Gross Sales","Avg. Item Cost","COGS $"]
{"$rows_left_out":53}
{"sheet":"Cat 3 CM$","index":13,"n_rows":173,"n_cols":12,"rows_kept":173,"cut":false,"hidden":false,"merged":[[172,3,172,4],[133,1,134,1],[136,1,137,1],[139,1,140,1],[142,1,143,1],[145,1,146,1],[148,1,149,1],[151,1,152,1],[154,1,155,1],[158,1,159,2],[160,1,160,2],[171,3,171,4],[130,1,131,1],[97,1,98,1],[100,1,101,1],[103,1,104,1],[106,1,107,1],[109,1,110,1],[112,1,113,1],[115,1,116,1],[118,1,119,1],[121,1,122,1],[124,1,125,1],[127,1,128,1],[94,1,95,1],[61,1,62,1],[64,1,65,1],[67,1,68,1],[70,1,71,1],[73,1,74,1],[76,1,77,1],[79,1,80,1],[82,1,83,1],[85,1,86,1],[88,1,89,1],[91,1,92,1],[58,1,59,1],[25,1,26,1],[28,1,29,1],[31,1,32,1],[34,1,35,1],[37,1,38,1],[40,1,41,1],[43,1,44,1],[46,1,47,1],[49,1,50,1],[52,1,53,1],[55,1,56,1],[22,1,23,1],[7,1,8,1],[10,1,11,1],[13,1,14,1],[16,1,17,1],[19,1,20,1]]}
[null,"Restaurant Name",{"$f":"'Cat 3 Setup'!L1","v":0}]
[null,"Start Date:",{"$f":"'Cat 3 Setup'!L5","v":"00:00:00"},null,"Check Count:",{"$f":"'Cat 3 Setup'!N1","v":0}]
[null,"End Date",{"$f":"'Cat 3 Setup'!N5","v":"00:00:00"},null,"Cover Count:",{"$f":"'Cat 3 Setup'!N2","v":0}]
[null,"Meal Period:",{"$f":"'Cat 3 Setup'!L2","v":0},null,"Average Check:",{"$f":"'Cat 3 Setup'!N3","v":0}]
[null,"Revenue Center:",{"$f":"'Cat 3 Setup'!L3","v":0},null,"Menu Category",{"$f":"'Cat 3 Setup'!L4","v":0}]
[]
[null,"Item Name","Quadrant","Item Sales","Qty Sold","Food Cost","Menu Mix %","Item Cost %","Contribution Margin $","Item Price","Item/Cover%","Item Cost"]
["Baseline",{"$f":"'Cat 3 Setup'!A9","v":0},{"$f":"IFERROR(IF(AND(I8>$I$159,G8>$G$159),\"Star\",IF(AND(I8>$I$159,G8<$G$159),\"Puzzle\",IF(AND(I8<$I$159,G8>$G$159),\"Plow Horse\",\"Dog\"))),\"\")","v":"Dog"},{"$f":"IFERROR(VLOOKUP(B8,'Cat 3 Setup'!$A:$F,4,FALSE),\"\")","v":""},{"$f":"IFERROR(VLOOKUP(B8,'Cat 3 Setup'!$A:$F,3,FALSE),\"\")","v":0},{"$f":"IFERROR(VLOOKUP(B8,'Cat 3 Setup'!$A:$F,6,FALSE),\"\")","v":""},{"$f":"IFERROR(E8/$E$159,\"\")","v":""},{"$f":"IFERROR(F8/D8,\"\")","v":""},{"$f":"IFERROR(J8-L8,\"\")","v":""},{"$f":"IFERROR(D8/E8,\"\")","v":""},{"$f":"IFERROR(E8/$F$3,\"\")","v":""},{"$f":"IFERROR(J8*H8,\"\")","v":""}]
{"$rows_left_out":166}
{"sheet":"Cat 3 CM$ Chart","index":14,"n_rows":46,"n_cols":7,"rows_kept":46,"cut":false,"hidden":false,"merged":[[44,3,44,4],[45,3,45,4]]}
[{"$f":"CONCATENATE('Cat 3 CM$'!C1,\" \",'Cat 3 CM$'!C5,\" \",'Cat 3 CM$'!C4,\" - \",'Cat 3 CM$'!F5)","v":"0 0 0 - 0"}]
["Menu Enginnering Graph by Contribution Margin Dollars"]
[]
[]
[]
[]
[]
[]
{"$rows_left_out":39}
{"sheet":"Cat 3 CM%","index":15,"n_rows":173,"n_cols":12,"rows_kept":173,"cut":false,"hidden":false,"merged":[[172,3,172,4],[133,1,134,1],[136,1,137,1],[139,1,140,1],[142,1,143,1],[145,1,146,1],[148,1,149,1],[151,1,152,1],[154,1,155,1],[158,1,159,2],[160,1,160,2],[171,3,171,4],[130,1,131,1],[97,1,98,1],[100,1,101,1],[103,1,104,1],[106,1,107,1],[109,1,110,1],[112,1,113,1],[115,1,116,1],[118,1,119,1],[121,1,122,1],[124,1,125,1],[127,1,128,1],[94,1,95,1],[61,1,62,1],[64,1,65,1],[67,1,68,1],[70,1,71,1],[73,1,74,1],[76,1,77,1],[79,1,80,1],[82,1,83,1],[85,1,86,1],[88,1,89,1],[91,1,92,1],[58,1,59,1],[25,1,26,1],[28,1,29,1],[31,1,32,1],[34,1,35,1],[37,1,38,1],[40,1,41,1],[43,1,44,1],[46,1,47,1],[49,1,50,1],[52,1,53,1],[55,1,56,1],[22,1,23,1],[7,1,8,1],[10,1,11,1],[13,1,14,1],[16,1,17,1],[19,1,20,1]]}
[null,"Restaurant Name",{"$f":"'Cat 3 Setup'!L1","v":0}]
[null,"Start Date:",{"$f":"'Cat 3 Setup'!L5","v":"00:00:00"},null,"Check Count:",{"$f":"'Cat 3 Setup'!N1","v":0}]
[null,"End Date",{"$f":"'Cat 3 Setup'!N5","v":"00:00:00"},null,"Cover Count:",{"$f":"'Cat 3 Setup'!N2","v":0}]
[null,"Meal Period:",{"$f":"'Cat 3 Setup'!L2","v":0},null,"Average Check:",{"$f":"'Cat 3 Setup'!N3","v":0}]
[null,"Revenue Center:",{"$f":"'Cat 3 Setup'!L3","v":0},null,"Menu Category",{"$f":"'Cat 3 Setup'!L4","v":0}]
[]
[null,"Item Name","Quadrant","Item Sales","Qty Sold","Food Cost","Menu Mix %","Item Cost %","Contribution Margin %","Item Price","Item/Cover%","Item Cost"]
["Baseline",{"$f":"'Cat 3 Setup'!A9","v":0},{"$f":"IFERROR(IF(AND(I8>$I$159,G8>$G$159),\"Star\",IF(AND(I8>$I$159,G8<$G$159),\"Puzzle\",IF(AND(I8<$I$159,G8>$G$159),\"Plow Horse\",\"Dog\"))),\"\")","v":"Dog"},{"$f":"IFERROR(VLOOKUP(B8,'Cat 3 Setup'!$A:$F,4,FALSE),\"\")","v":""},{"$f":"IFERROR(VLOOKUP(B8,'Cat 3 Setup'!$A:$F,3,FALSE),\"\")","v":0},{"$f":"IFERROR(VLOOKUP(B8,'Cat 3 Setup'!$A:$F,6,FALSE),\"\")","v":""},{"$f":"IFERROR(E8/$E$159,\"\")","v":""},{"$f":"IFERROR(F8/D8,\"\")","v":""},{"$f":"IFERROR((J8-L8)/J8,\"\")","v":""},{"$f":"IFERROR(D8/E8,\"\")","v":""},{"$f":"IFERROR(E8/$F$3,\"\")","v":""},{"$f":"IFERROR(J8*H8,\"\")","v":""}]
{"$rows_left_out":166}
{"sheet":"Cat 3 CM% Chart","index":16,"n_rows":46,"n_cols":7,"rows_kept":46,"cut":false,"hidden":false,"merged":[[44,3,44,4],[45,3,45,4]]}
[{"$f":"CONCATENATE('Cat 3 CM$'!C1,\" \",'Cat 3 CM$'!C5,\" \",'Cat 3 CM$'!C4,\" - \",'Cat 3 CM$'!F5)","v":"0 0 0 - 0"}]
["Menu Enginnering Graph by Contribution Margin Percentage"]
[]
[]
[]
[]
[]
[]
{"$rows_left_out":39}
{"sheet":"Costing-BP","index":17,"n_rows":111,"n_cols":4,"rows_kept":111,"cut":false,"hidden":true,"merged":[]}
["Appetizers-MC",null,null,"Cost"]
[3025078,"Fajita Chicken Nachos",null,2.68]
[3025079,"Jumbo Buffalo Wings",null,3.21]
[3025069,"Factory Soup of the Day",null,0.75]
[3025081,"Breaded Calamari",null,2.0499999999999998]
[3025077,"Stack of Rings",null,2.52]
[3025083,"Mango-Chicken Quesadilla",null,2.4]
[3025080,"Louisianna Crab Cakes",null,3.71]
{"$rows_left_out":104}
{"sheet":"Costing-Cafe","index":18,"n_rows":250,"n_cols":4,"rows_kept":250,"cut":false,"hidden":true,"merged":[]}
["Appetizers-MC",null,null,"Cost"]
[3004001,"Chicken Quesadilla",null,1.58]
[3004002,"Chicken Tenders",null,1.56]
[3004016,"WP Tempura Zucchini",null,1]
[3000041,"Cafe Wings",null,1.82]
[3004011,"Spin Artich Dip",null,2.13]
[3004024,"WP Seared Filet Mignon",null,2.5]
[3004021,"WP Ponzu Scallops",null,2]
{"$rows_left_out":243}
{"sheet":"Insights_Actions","index":19,"n_rows":10,"n_cols":7,"rows_kept":10,"cut":false,"hidden":true,"merged":[[1,0,2,0],[1,1,2,1],[1,2,1,6],[4,0,5,0],[4,1,5,1],[4,2,5,2],[4,3,5,3],[4,5,5,5],[4,6,5,6],[8,4,9,4],[8,5,9,5],[8,6,9,6],[6,0,7,0],[6,1,7,1],[6,2,7,2],[6,4,7,4],[6,5,7,5],[6,6,7,6],[8,0,9,0],[8,1,9,1],[8,2,9,2]]}
[]
["Quadrant","Insights","Actions"]
[null,null,"Alter Sales Strategy","Decrease Cost","Alter Menu","Alter Price","Other"]
["Star","Item has high profitability and high volume","Maintain quality specs",null,"Feature prominently on menu","Increase price ","Do Nothing"]
["Puzzle","Item has high profitability and low volume","Offer as special",null,"Rename item","Decrease price","Remove from menu"]
[null,null,null,null,"Feature prominently on menu"]
["Plow horse","Item has low profitability and high volume","Avoid offering as special","Reduce portion sizes","Move to less prominent place on menu","Increase price"]
[null,null,null,"Find alternate ingredients"]
{"$rows_left_out":3}
{"sheet":"Sheet5","index":20,"n_rows":0,"n_cols":0,"rows_kept":0,"cut":false,"hidden":true,"merged":[]}